BDBM50113826 3-Phenyl-propylamine::3-phenylpropylamine::CHEMBL276864
SMILES: NCCCc1ccccc1
InChI Key: InChIKey=LYUQWQRTDLVQGA-UHFFFAOYSA-N
Data: 1 KI  1 Kd
Activity Spreadsheet -- Enzyme Inhibition Constant Data from BindingDB
Found 2 hits for monomerid = 50113826
Trg + Lig
Ki
nM
ΔG°
kcal/mole
IC50
nM
Kd
nM
EC50/IC50
nM
koff
s-1
kon
M-1s-1
pHTemp
°C
Trypsin-1
(Homo sapiens (Human))
BDBM50113826
(3-Phenyl-propylamine | 3-phenylpropylamine | CHEMB...)
Show SMILES NCCCc1ccccc1
Show InChI InChI=1S/C9H13N/c10-8-4-7-9-5-2-1-3-6-9/h1-3,5-6H,4,7-8,10H2
Reactome pathway
3.25E+4n/an/an/an/an/an/an/an/a
University of Parma
Curated by ChEMBL
Assay Description
Binding affinity against bovine trypsin
J Med Chem 45: 2469-83 (2002)
BindingDB Entry DOI: 10.7270/Q28916J7
Thrombin & trypsin
(Homo sapiens (Human))
BDBM50113826
(3-Phenyl-propylamine | 3-phenylpropylamine | CHEMB...)
Show SMILES NCCCc1ccccc1
Show InChI InChI=1S/C9H13N/c10-8-4-7-9-5-2-1-3-6-9/h1-3,5-6H,4,7-8,10H2
Reactome pathway
n/an/an/a 3.24E+7n/an/an/an/an/a
Harvard University
Curated by ChEMBL
Assay Description
Binding affinity against trypsin
J Med Chem 45: 2770-80 (2002)
Article DOI: 10.1021/jm0105833
BindingDB Entry DOI: 10.7270/Q2MG7S8S