BDBM50113978 CHEMBL3605543
SMILES: CCn1c(nc2ccc(cc12)C(F)(F)F)[C@@H](C)NS(=O)(=O)c1ccncc1
InChI Key: InChIKey=XJBSZQUEIDNMDR-LLVKDONJSA-N
Data: 1 IC50  1 EC50
Activity Spreadsheet -- Enzyme Inhibition Constant Data from BindingDB
Found 2 hits for monomerid = 50113978
Trg + Lig
Ki
nM
ΔG°
kcal/mole
IC50
nM
Kd
nM
EC50/IC50
nM
koff
s-1
kon
M-1s-1
pHTemp
°C
Cytochrome P450 2C19
(Homo sapiens (Human))
BDBM50113978
(CHEMBL3605543)
Show SMILES CCn1c(nc2ccc(cc12)C(F)(F)F)[C@@H](C)NS(=O)(=O)c1ccncc1 |r|
Show InChI InChI=1S/C17H17F3N4O2S/c1-3-24-15-10-12(17(18,19)20)4-5-14(15)22-16(24)11(2)23-27(25,26)13-6-8-21-9-7-13/h4-11,23H,3H2,1-2H3/t11-/m1/s1
Reactome pathway
n/an/a 40n/an/an/an/an/an/a
AstraZeneca
Curated by ChEMBL
Assay Description
Inhibition of CYP2C19 in human liver microsomes incubated for 5 mins in presence of NADPH and specific substrates by LC/MS/MS method
J Med Chem 58: 7057-75 (2015)
BindingDB Entry DOI: 10.7270/Q2Z89F6J
Sphingosine 1-phosphate receptor 1
(Homo sapiens (Human))
BDBM50113978
(CHEMBL3605543)
Show SMILES CCn1c(nc2ccc(cc12)C(F)(F)F)[C@@H](C)NS(=O)(=O)c1ccncc1 |r|
Show InChI InChI=1S/C17H17F3N4O2S/c1-3-24-15-10-12(17(18,19)20)4-5-14(15)22-16(24)11(2)23-27(25,26)13-6-8-21-9-7-13/h4-11,23H,3H2,1-2H3/t11-/m1/s1
Reactome pathway
n/an/an/an/a 26n/an/an/an/a
AstraZeneca
Curated by ChEMBL
Assay Description
Antagonist activity against human S1P1 receptor expressed in human U2OS cells co-expressing GFP assessed as inhibition of S1P-induced receptor transl...
J Med Chem 58: 7057-75 (2015)
BindingDB Entry DOI: 10.7270/Q2Z89F6J