BDBM50114095 4-[(2R,3S)-4-(4,5-dihydroxy-2-nitrophenyl)-2,3-dimethylbutyl]-5-nitrobenzene-1,2-diol::CHEMBL92359
SMILES: C[C@@H](Cc1cc(O)c(O)cc1[N+]([O-])=O)[C@H](C)Cc1cc(O)c(O)cc1[N+]([O-])=O
InChI Key: InChIKey=FYRRTSVQMATNSC-AOOOYVTPSA-N
Data: 2 IC50
Activity Spreadsheet -- Enzyme Inhibition Constant Data from BindingDB
Found 2 hits for monomerid = 50114095
Trg + Lig
Ki
nM
ΔG°
kcal/mole
IC50
nM
Kd
nM
EC50/IC50
nM
koff
s-1
kon
M-1s-1
pHTemp
°C
Arachidonate 15-lipoxygenase
(Homo sapiens (Human))
BDBM50114095
(4-[(2R,3S)-4-(4,5-dihydroxy-2-nitrophenyl)-2,3-dim...)
Show SMILES C[C@@H](Cc1cc(O)c(O)cc1[N+]([O-])=O)[C@H](C)Cc1cc(O)c(O)cc1[N+]([O-])=O
Show InChI InChI=1S/C18H20N2O8/c1-9(3-11-5-15(21)17(23)7-13(11)19(25)26)10(2)4-12-6-16(22)18(24)8-14(12)20(27)28/h5-10,21-24H,3-4H2,1-2H3/t9-,10+
Reactome pathway
n/an/a 350n/an/an/an/an/an/a
University of California
Curated by ChEMBL
Assay Description
Inhibitory activity against human reticulocyte 15-lipoxygenase (15-HLO)
J Med Chem 45: 2659-61 (2002)
BindingDB Entry DOI: 10.7270/Q2GT5NWN
12-Lipoxygenase (12-LOX)
(Homo sapiens (Human))
BDBM50114095
(4-[(2R,3S)-4-(4,5-dihydroxy-2-nitrophenyl)-2,3-dim...)
Show SMILES C[C@@H](Cc1cc(O)c(O)cc1[N+]([O-])=O)[C@H](C)Cc1cc(O)c(O)cc1[N+]([O-])=O
Show InChI InChI=1S/C18H20N2O8/c1-9(3-11-5-15(21)17(23)7-13(11)19(25)26)10(2)4-12-6-16(22)18(24)8-14(12)20(27)28/h5-10,21-24H,3-4H2,1-2H3/t9-,10+
n/an/a 360n/an/an/an/an/an/a
University of California
Curated by ChEMBL
Assay Description
Inhibitory activity against human platelet 12-lipoxygenase (12-HLO)
J Med Chem 45: 2659-61 (2002)
BindingDB Entry DOI: 10.7270/Q2GT5NWN