BDBM50114356 CHEMBL3604069
SMILES: [Na+].[H][C@]1(O[C@@](C[C@H](O)[C@H]1NC(C)=O)(OC)C([O-])=O)[C@H](O)[C@H](O)CO
InChI Key: InChIKey=WAEZEQUBHGTBMQ-JDZDBOTCSA-M
Data: 1 IC50
Activity Spreadsheet -- Enzyme Inhibition Constant Data from BindingDB
Found 1 hit for monomerid = 50114356
Trg + Lig
Ki
nM
ΔG°
kcal/mole
IC50
nM
Kd
nM
EC50/IC50
nM
koff
s-1
kon
M-1s-1
pHTemp
°C
Sialic acid-binding Ig-like lectin 7
(Homo sapiens (Human))
BDBM50114356
(CHEMBL3604069)
Show SMILES [Na+].[H][C@]1(O[C@@](C[C@H](O)[C@H]1NC(C)=O)(OC)C([O-])=O)[C@H](O)[C@H](O)CO |r|
Show InChI InChI=1S/C12H21NO9.Na/c1-5(15)13-8-6(16)3-12(21-2,11(19)20)22-10(8)9(18)7(17)4-14;/h6-10,14,16-18H,3-4H2,1-2H3,(H,13,15)(H,19,20);/q;+1/p-1/t6-,7+,8+,9+,10+,12+;/m0./s1
n/an/a 8.08E+6n/an/an/an/an/an/a
G3-BioTec
Curated by ChEMBL
Assay Description
Binding affinity to human IgG1-fused human Siglec-7-FC (Gln19 to Gly357 residues) assessed as inhibition Siglec-7-Fc binding to to RBC pre-incubated ...
Bioorg Med Chem 23: 5915-21 (2015)
BindingDB Entry DOI: 10.7270/Q2FB54RH