BDBM50114360 CHEMBL256155
SMILES: O=C1C=C(Oc2ccccc2)C(=O)c2ccccc12
InChI Key: InChIKey=UCWKLNZSXHXPMB-UHFFFAOYSA-N
Data: 1 IC50
Activity Spreadsheet -- Enzyme Inhibition Constant Data from BindingDB
Found 1 hit for monomerid = 50114360
Trg + Lig
Ki
nM
ΔG°
kcal/mole
IC50
nM
Kd
nM
EC50/IC50
nM
koff
s-1
kon
M-1s-1
pHTemp
°C
Glyceraldehyde-3-phosphate dehydrogenase liver
(Homo sapiens (Human))
BDBM50114360
(CHEMBL256155)
Show SMILES O=C1C=C(Oc2ccccc2)C(=O)c2ccccc12 |t:2|
Show InChI InChI=1S/C16H10O3/c17-14-10-15(19-11-6-2-1-3-7-11)16(18)13-9-5-4-8-12(13)14/h1-10H
NCI pathway
Reactome pathway
n/an/a 590n/an/an/an/an/an/a
Alma Mater Studiorum - University of Bologna
Curated by ChEMBL
Assay Description
Inhibition of recombinant human GAPDH assessed as oxidative phosphorylation of D-glyceraldehyde-3-phosphate to 1,3-bisphosphoglycerate by spectrophot...
J Med Chem 58: 6422-34 (2015)
BindingDB Entry DOI: 10.7270/Q29K4D2N