BDBM50114467 2-(3-Carbamimidoyl-phenoxy)-4-methanesulfonylamino-N-(2'-sulfamoyl-biphenyl-4-yl)-benzamide::CHEMBL46410
SMILES: CS(=O)(=O)Nc1ccc(C(=O)Nc2ccc(cc2)-c2ccccc2S(N)(=O)=O)c(Oc2cccc(c2)C(N)=N)c1
InChI Key: InChIKey=GFTDNSMIRBLHTL-UHFFFAOYSA-N
Data: 1 IC50
Activity Spreadsheet -- Enzyme Inhibition Constant Data from BindingDB
Found 1 hit for monomerid = 50114467
Trg + Lig
Ki
nM
ΔG°
kcal/mole
IC50
nM
Kd
nM
EC50/IC50
nM
koff
s-1
kon
M-1s-1
pHTemp
°C
Coagulation factor X
(Homo sapiens (Human))
BDBM50114467
(2-(3-Carbamimidoyl-phenoxy)-4-methanesulfonylamino...)
Show SMILES CS(=O)(=O)Nc1ccc(C(=O)Nc2ccc(cc2)-c2ccccc2S(N)(=O)=O)c(Oc2cccc(c2)C(N)=N)c1
Show InChI InChI=1S/C27H25N5O6S2/c1-39(34,35)32-20-13-14-23(24(16-20)38-21-6-4-5-18(15-21)26(28)29)27(33)31-19-11-9-17(10-12-19)22-7-2-3-8-25(22)40(30,36)37/h2-16,32H,1H3,(H3,28,29)(H,31,33)(H2,30,36,37)
Reactome pathway
n/an/a 31n/an/an/an/an/an/a
Millennium Pharmaceuticals, Inc.
Curated by ChEMBL
Assay Description
Tested in vitro for the inhibitory activity against Coagulation factor Xa
Bioorg Med Chem Lett 12: 1657-61 (2002)
BindingDB Entry DOI: 10.7270/Q2R49Q2T