BDBM50114475 2-(3-Carbamimidoyl-phenoxy)-4-chloro-N-(2'-sulfamoyl-biphenyl-4-yl)-benzamide::CHEMBL44049
SMILES: NC(=N)c1cccc(Oc2cc(Cl)ccc2C(=O)Nc2ccc(cc2)-c2ccccc2S(N)(=O)=O)c1
InChI Key: InChIKey=FOZBKUFGCFEWTJ-UHFFFAOYSA-N
Data: 1 IC50
Activity Spreadsheet -- Enzyme Inhibition Constant Data from BindingDB
Found 1 hit for monomerid = 50114475
Trg + Lig
Ki
nM
ΔG°
kcal/mole
IC50
nM
Kd
nM
EC50/IC50
nM
koff
s-1
kon
M-1s-1
pHTemp
°C
Coagulation factor X
(Homo sapiens (Human))
BDBM50114475
(2-(3-Carbamimidoyl-phenoxy)-4-chloro-N-(2'-sulfamo...)
Show SMILES NC(=N)c1cccc(Oc2cc(Cl)ccc2C(=O)Nc2ccc(cc2)-c2ccccc2S(N)(=O)=O)c1
Show InChI InChI=1S/C26H21ClN4O4S/c27-18-10-13-22(23(15-18)35-20-5-3-4-17(14-20)25(28)29)26(32)31-19-11-8-16(9-12-19)21-6-1-2-7-24(21)36(30,33)34/h1-15H,(H3,28,29)(H,31,32)(H2,30,33,34)
Reactome pathway
n/an/a 1.5n/an/an/an/an/an/a
Millennium Pharmaceuticals, Inc.
Curated by ChEMBL
Assay Description
Tested in vitro for the inhibitory activity against Coagulation factor Xa
Bioorg Med Chem Lett 12: 1657-61 (2002)
BindingDB Entry DOI: 10.7270/Q2R49Q2T