BDBM50114736 CHEMBL386583::[1-(2-Acetylamino-hexanoyl)-17-(4-amino-butyl)-8-benzyl-11-(3-guanidino-propyl)-5-(3H-imidazol-4-ylmethyl)-14-(1H-indol-3-ylmethyl)-3,6,9,12,15,18-hexaoxo-1,4,7,10,13,16hexaaza-cyclooctadec-2-yl]-acetic acid(MTII)
SMILES: CCCC[C@H](NC(C)=O)C(=O)N1[C@@H](CC(O)=O)C(=O)N[C@H](Cc2cnc[nH]2)C(=O)N[C@@H](Cc2ccccc2)C(=O)N[C@H](CCCNC(N)=N)C(=O)N[C@@H](Cc2c[nH]c3ccccc23)C(=O)N[C@H](CCCCN)C1=O
InChI Key: InChIKey=ULUABNVCTYCFOE-UHDHNNMDSA-N
Data: 4 EC50
Activity Spreadsheet -- Enzyme Inhibition Constant Data from BindingDB
Found 4 hits for monomerid = 50114736
Trg + Lig
Ki
nM
ΔG°
kcal/mole
IC50
nM
Kd
nM
EC50/IC50
nM
koff
s-1
kon
M-1s-1
pHTemp
°C
Melanocortin receptor 3
(Mus musculus)
BDBM50114736
(CHEMBL386583 | [1-(2-Acetylamino-hexanoyl)-17-(4-a...)
Show SMILES CCCC[C@H](NC(C)=O)C(=O)N1[C@@H](CC(O)=O)C(=O)N[C@H](Cc2cnc[nH]2)C(=O)N[C@@H](Cc2ccccc2)C(=O)N[C@H](CCCNC(N)=N)C(=O)N[C@@H](Cc2c[nH]c3ccccc23)C(=O)N[C@H](CCCCN)C1=O
Show InChI InChI=1S/C50H68N14O10/c1-3-4-16-36(58-29(2)65)48(73)64-41(25-42(66)67)47(72)63-40(24-32-27-54-28-57-32)46(71)61-38(22-30-13-6-5-7-14-30)44(69)59-35(19-12-21-55-50(52)53)43(68)62-39(23-31-26-56-34-17-9-8-15-33(31)34)45(70)60-37(49(64)74)18-10-11-20-51/h5-9,13-15,17,26-28,35-41,56H,3-4,10-12,16,18-25,51H2,1-2H3,(H,54,57)(H,58,65)(H,59,69)(H,60,70)(H,61,71)(H,62,68)(H,63,72)(H,66,67)(H4,52,53,55)/t35-,36+,37-,38+,39+,40-,41+/m1/s1
Reactome pathway
n/an/an/an/a 0.160n/an/an/an/a
University of Florida
Curated by ChEMBL
Assay Description
In vitro activaction of mouse recombinant Melanocortin-3 receptor.
J Med Chem 45: 2801-10 (2002)
BindingDB Entry DOI: 10.7270/Q27945DV
Melanocortin receptor 1
(Mus musculus)
BDBM50114736
(CHEMBL386583 | [1-(2-Acetylamino-hexanoyl)-17-(4-a...)
Show SMILES CCCC[C@H](NC(C)=O)C(=O)N1[C@@H](CC(O)=O)C(=O)N[C@H](Cc2cnc[nH]2)C(=O)N[C@@H](Cc2ccccc2)C(=O)N[C@H](CCCNC(N)=N)C(=O)N[C@@H](Cc2c[nH]c3ccccc23)C(=O)N[C@H](CCCCN)C1=O
Show InChI InChI=1S/C50H68N14O10/c1-3-4-16-36(58-29(2)65)48(73)64-41(25-42(66)67)47(72)63-40(24-32-27-54-28-57-32)46(71)61-38(22-30-13-6-5-7-14-30)44(69)59-35(19-12-21-55-50(52)53)43(68)62-39(23-31-26-56-34-17-9-8-15-33(31)34)45(70)60-37(49(64)74)18-10-11-20-51/h5-9,13-15,17,26-28,35-41,56H,3-4,10-12,16,18-25,51H2,1-2H3,(H,54,57)(H,58,65)(H,59,69)(H,60,70)(H,61,71)(H,62,68)(H,63,72)(H,66,67)(H4,52,53,55)/t35-,36+,37-,38+,39+,40-,41+/m1/s1
n/an/an/an/a 0.0200n/an/an/an/a
University of Florida
Curated by ChEMBL
Assay Description
In vitro activaction of mouse recombinant Melanocortin-1 receptor.
J Med Chem 45: 2801-10 (2002)
BindingDB Entry DOI: 10.7270/Q27945DV
Melanocortin receptor 5 (MC5R)
(Mus musculus (Mouse))
BDBM50114736
(CHEMBL386583 | [1-(2-Acetylamino-hexanoyl)-17-(4-a...)
Show SMILES CCCC[C@H](NC(C)=O)C(=O)N1[C@@H](CC(O)=O)C(=O)N[C@H](Cc2cnc[nH]2)C(=O)N[C@@H](Cc2ccccc2)C(=O)N[C@H](CCCNC(N)=N)C(=O)N[C@@H](Cc2c[nH]c3ccccc23)C(=O)N[C@H](CCCCN)C1=O
Show InChI InChI=1S/C50H68N14O10/c1-3-4-16-36(58-29(2)65)48(73)64-41(25-42(66)67)47(72)63-40(24-32-27-54-28-57-32)46(71)61-38(22-30-13-6-5-7-14-30)44(69)59-35(19-12-21-55-50(52)53)43(68)62-39(23-31-26-56-34-17-9-8-15-33(31)34)45(70)60-37(49(64)74)18-10-11-20-51/h5-9,13-15,17,26-28,35-41,56H,3-4,10-12,16,18-25,51H2,1-2H3,(H,54,57)(H,58,65)(H,59,69)(H,60,70)(H,61,71)(H,62,68)(H,63,72)(H,66,67)(H4,52,53,55)/t35-,36+,37-,38+,39+,40-,41+/m1/s1
n/an/an/an/a 0.160n/an/an/an/a
University of Florida
Curated by ChEMBL
Assay Description
In vitro activaction of mouse recombinant Melanocortin-5 receptor.
J Med Chem 45: 2801-10 (2002)
BindingDB Entry DOI: 10.7270/Q27945DV
Melanocortin receptor 4
(Mus musculus)
BDBM50114736
(CHEMBL386583 | [1-(2-Acetylamino-hexanoyl)-17-(4-a...)
Show SMILES CCCC[C@H](NC(C)=O)C(=O)N1[C@@H](CC(O)=O)C(=O)N[C@H](Cc2cnc[nH]2)C(=O)N[C@@H](Cc2ccccc2)C(=O)N[C@H](CCCNC(N)=N)C(=O)N[C@@H](Cc2c[nH]c3ccccc23)C(=O)N[C@H](CCCCN)C1=O
Show InChI InChI=1S/C50H68N14O10/c1-3-4-16-36(58-29(2)65)48(73)64-41(25-42(66)67)47(72)63-40(24-32-27-54-28-57-32)46(71)61-38(22-30-13-6-5-7-14-30)44(69)59-35(19-12-21-55-50(52)53)43(68)62-39(23-31-26-56-34-17-9-8-15-33(31)34)45(70)60-37(49(64)74)18-10-11-20-51/h5-9,13-15,17,26-28,35-41,56H,3-4,10-12,16,18-25,51H2,1-2H3,(H,54,57)(H,58,65)(H,59,69)(H,60,70)(H,61,71)(H,62,68)(H,63,72)(H,66,67)(H4,52,53,55)/t35-,36+,37-,38+,39+,40-,41+/m1/s1
n/an/an/an/a 0.0870n/an/an/an/a
University of Florida
Curated by ChEMBL
Assay Description
In vitro activaction of mouse recombinant Melanocortin-4 receptor.
J Med Chem 45: 2801-10 (2002)
BindingDB Entry DOI: 10.7270/Q27945DV