BDBM50114793 CHEMBL3608392
SMILES: COc1cc(ccc1-c1cnn(C)c1)-c1cn(nn1)[C@H]1CCc2c(F)cccc2N(CC(F)(F)F)C1=O
InChI Key: InChIKey=CNUOVJNPAJBGDE-QFIPXVFZSA-N
Data: 2 IC50
Activity Spreadsheet -- Enzyme Inhibition Constant Data from BindingDB
Found 2 hits for monomerid = 50114793
Trg + Lig
Ki
nM
ΔG°
kcal/mole
IC50
nM
Kd
nM
EC50/IC50
nM
koff
s-1
kon
M-1s-1
pHTemp
°C
Gamma-Secretase Subunit APH-1A/Gamma-Secretase Subunit PEN-2/Gamma-Secretase Subunit Presenilin-1/Gamma-secretase subunit APH-1B/Nicastrin /Presenilin 2
(Homo sapiens (Human))
BDBM50114793
(CHEMBL3608392)
Show SMILES COc1cc(ccc1-c1cnn(C)c1)-c1cn(nn1)[C@H]1CCc2c(F)cccc2N(CC(F)(F)F)C1=O |r|
Show InChI InChI=1S/C25H22F4N6O2/c1-33-12-16(11-30-33)17-7-6-15(10-23(17)37-2)20-13-35(32-31-20)22-9-8-18-19(26)4-3-5-21(18)34(24(22)36)14-25(27,28)29/h3-7,10-13,22H,8-9,14H2,1-2H3/t22-/m0/s1
n/an/a 120n/an/an/an/an/an/a
Merck Research Laboratories
Curated by ChEMBL
Assay Description
Modulation of gamma-secretase in human SH-SY5Y cells overexpressing APP C-terminal fragment SPA4CT assessed as inhibition of intracellular amyloid be...
Bioorg Med Chem Lett 25: 3495-500 (2015)
BindingDB Entry DOI: 10.7270/Q2125VFP
Gamma-Secretase Subunit APH-1A/Gamma-Secretase Subunit PEN-2/Gamma-Secretase Subunit Presenilin-1/Gamma-secretase subunit APH-1B/Nicastrin /Presenilin 2
(Homo sapiens (Human))
BDBM50114793
(CHEMBL3608392)
Show SMILES COc1cc(ccc1-c1cnn(C)c1)-c1cn(nn1)[C@H]1CCc2c(F)cccc2N(CC(F)(F)F)C1=O |r|
Show InChI InChI=1S/C25H22F4N6O2/c1-33-12-16(11-30-33)17-7-6-15(10-23(17)37-2)20-13-35(32-31-20)22-9-8-18-19(26)4-3-5-21(18)34(24(22)36)14-25(27,28)29/h3-7,10-13,22H,8-9,14H2,1-2H3/t22-/m0/s1
n/an/a 26n/an/an/an/an/an/a
Merck Research Laboratories
Curated by ChEMBL
Assay Description
Modulation of gamma-secretase in human SH-SY5Y cells overexpressing APP C-terminal fragment SPA4CT assessed as inhibition of intracellular amyloid be...
Bioorg Med Chem Lett 25: 3495-500 (2015)
BindingDB Entry DOI: 10.7270/Q2125VFP