null
SMILES: Cc1cn(cn1)-c1ccc(cc1OCC(F)(F)F)-c1cn(nn1)[C@H]1CCc2c(F)cccc2N(CC(F)(F)F)C1=O
InChI Key: InChIKey=CXFTXUPYIHPUAT-QFIPXVFZSA-N
Activity Spreadsheet -- Enzyme Inhibition Constant Data from BindingDB
Found 4 hits for monomerid = 50114807
Trg + Lig
Ki
nM
ΔG°
kcal/mole
IC50
nM
Kd
nM
EC50/IC50
nM
koff
s-1
kon
M-1s-1
pHTemp
°C
Potassium voltage-gated channel subfamily H member 2
(Homo sapiens (Human))
BDBM50114807
(CHEMBL3608385)
Show SMILES Cc1cn(cn1)-c1ccc(cc1OCC(F)(F)F)-c1cn(nn1)[C@H]1CCc2c(F)cccc2N(CC(F)(F)F)C1=O |r|
Show InChI InChI=1S/C26H21F7N6O2/c1-15-10-37(14-34-15)21-7-5-16(9-23(21)41-13-26(31,32)33)19-11-39(36-35-19)22-8-6-17-18(27)3-2-4-20(17)38(24(22)40)12-25(28,29)30/h2-5,7,9-11,14,22H,6,8,12-13H2,1H3/t22-/m0/s1
Reactome pathway
2.00E+3n/an/an/an/an/an/an/an/a
Merck Research Laboratories
Curated by ChEMBL
Assay Description
Binding affinity to human ERG expressed in HEK293 cells by radioligand displacement assay
Bioorg Med Chem Lett 25: 3495-500 (2015)
BindingDB Entry DOI: 10.7270/Q2125VFP
Potassium voltage-gated channel subfamily H member 2
(Homo sapiens (Human))
BDBM50114807
(CHEMBL3608385)
Show SMILES Cc1cn(cn1)-c1ccc(cc1OCC(F)(F)F)-c1cn(nn1)[C@H]1CCc2c(F)cccc2N(CC(F)(F)F)C1=O |r|
Show InChI InChI=1S/C26H21F7N6O2/c1-15-10-37(14-34-15)21-7-5-16(9-23(21)41-13-26(31,32)33)19-11-39(36-35-19)22-8-6-17-18(27)3-2-4-20(17)38(24(22)40)12-25(28,29)30/h2-5,7,9-11,14,22H,6,8,12-13H2,1H3/t22-/m0/s1
Reactome pathway
n/an/an/an/a 1.30E+3n/an/an/an/a
Merck Research Laboratories
Curated by ChEMBL
Assay Description
Inhibition of human ERG expressed in CHO cells by patch clamp assay
Bioorg Med Chem Lett 25: 3495-500 (2015)
BindingDB Entry DOI: 10.7270/Q2125VFP
Gamma-secretase subunit APH-1A/Gamma-secretase subunit APH-1B/Gamma-secretase subunit PEN-2/Nicastrin/Presenilin-1/Presenilin-2
(Homo sapiens (Human))
BDBM50114807
(CHEMBL3608385)
Show SMILES Cc1cn(cn1)-c1ccc(cc1OCC(F)(F)F)-c1cn(nn1)[C@H]1CCc2c(F)cccc2N(CC(F)(F)F)C1=O |r|
Show InChI InChI=1S/C26H21F7N6O2/c1-15-10-37(14-34-15)21-7-5-16(9-23(21)41-13-26(31,32)33)19-11-39(36-35-19)22-8-6-17-18(27)3-2-4-20(17)38(24(22)40)12-25(28,29)30/h2-5,7,9-11,14,22H,6,8,12-13H2,1H3/t22-/m0/s1
n/an/a 440n/an/an/an/an/an/a
Merck Research Laboratories
Curated by ChEMBL
Assay Description
Modulation of gamma-secretase in human SH-SY5Y cells overexpressing APP C-terminal fragment SPA4CT assessed as inhibition of intracellular amyloid be...
Bioorg Med Chem Lett 25: 3495-500 (2015)
BindingDB Entry DOI: 10.7270/Q2125VFP
Gamma-secretase subunit APH-1A/Gamma-secretase subunit APH-1B/Gamma-secretase subunit PEN-2/Nicastrin/Presenilin-1/Presenilin-2
(Homo sapiens (Human))
BDBM50114807
(CHEMBL3608385)
Show SMILES Cc1cn(cn1)-c1ccc(cc1OCC(F)(F)F)-c1cn(nn1)[C@H]1CCc2c(F)cccc2N(CC(F)(F)F)C1=O |r|
Show InChI InChI=1S/C26H21F7N6O2/c1-15-10-37(14-34-15)21-7-5-16(9-23(21)41-13-26(31,32)33)19-11-39(36-35-19)22-8-6-17-18(27)3-2-4-20(17)38(24(22)40)12-25(28,29)30/h2-5,7,9-11,14,22H,6,8,12-13H2,1H3/t22-/m0/s1
n/an/a 78n/an/an/an/an/an/a
Merck Research Laboratories
Curated by ChEMBL
Assay Description
Modulation of gamma-secretase in human SH-SY5Y cells overexpressing APP C-terminal fragment SPA4CT assessed as inhibition of intracellular amyloid be...
Bioorg Med Chem Lett 25: 3495-500 (2015)
BindingDB Entry DOI: 10.7270/Q2125VFP