BDBM50114813 8-(4'-Bromo-biphenyl-4-yl)-8-oxo-octanoic acid hydroxyamide::8-(4'-bromobiphenyl-4-yl)-N-hydroxy-8-oxooctanamide::CHEMBL99456
SMILES: ONC(=O)CCCCCCC(=O)c1ccc(cc1)-c1ccc(Br)cc1
InChI Key: InChIKey=CHORFZKELKILNA-UHFFFAOYSA-N
Data: 3 IC50
Activity Spreadsheet -- Enzyme Inhibition Constant Data from BindingDB
Found 3 hits for monomerid = 50114813
Trg + Lig
Ki
nM
ΔG°
kcal/mole
IC50
nM
Kd
nM
EC50/IC50
nM
koff
s-1
kon
M-1s-1
pHTemp
°C
Cereblon/Histone deacetylase 1
(Homo sapiens (Human))
BDBM50114813
(8-(4'-Bromo-biphenyl-4-yl)-8-oxo-octanoic acid hyd...)
Show SMILES ONC(=O)CCCCCCC(=O)c1ccc(cc1)-c1ccc(Br)cc1
Show InChI InChI=1S/C20H22BrNO3/c21-18-13-11-16(12-14-18)15-7-9-17(10-8-15)19(23)5-3-1-2-4-6-20(24)22-25/h7-14,25H,1-6H2,(H,22,24)
NCI pathway
Reactome pathway
n/an/a 2n/an/an/an/an/an/a
MethylGene Inc.
Curated by ChEMBL
Assay Description
Inhibition against partially purified human histone deacetylase 1 (HDAC-1)
J Med Chem 45: 2877-85 (2002)
BindingDB Entry DOI: 10.7270/Q29W0DT3
Cereblon/Histone deacetylase 1
(Homo sapiens (Human))
BDBM50114813
(8-(4'-Bromo-biphenyl-4-yl)-8-oxo-octanoic acid hyd...)
Show SMILES ONC(=O)CCCCCCC(=O)c1ccc(cc1)-c1ccc(Br)cc1
Show InChI InChI=1S/C20H22BrNO3/c21-18-13-11-16(12-14-18)15-7-9-17(10-8-15)19(23)5-3-1-2-4-6-20(24)22-25/h7-14,25H,1-6H2,(H,22,24)
NCI pathway
Reactome pathway
n/an/a 2n/an/an/an/an/an/a
Aton Pharma, Inc
Curated by ChEMBL
Assay Description
Inhibitory concentration against recombinant human Histone deacetylase 1
J Med Chem 46: 5097-116 (2003)
Article DOI: 10.1021/jm0303094
BindingDB Entry DOI: 10.7270/Q2MP5413
Cereblon/Histone deacetylase 1
(Homo sapiens (Human))
BDBM50114813
(8-(4'-Bromo-biphenyl-4-yl)-8-oxo-octanoic acid hyd...)
Show SMILES ONC(=O)CCCCCCC(=O)c1ccc(cc1)-c1ccc(Br)cc1
Show InChI InChI=1S/C20H22BrNO3/c21-18-13-11-16(12-14-18)15-7-9-17(10-8-15)19(23)5-3-1-2-4-6-20(24)22-25/h7-14,25H,1-6H2,(H,22,24)
NCI pathway
Reactome pathway
n/an/a 2n/an/an/an/an/an/a
China Pharmaceutical University
Curated by ChEMBL
Assay Description
Inhibition of human HDAC1
Eur J Med Chem 44: 2868-76 (2009)
Article DOI: 10.1016/j.ejmech.2008.12.008
BindingDB Entry DOI: 10.7270/Q2HM58HD