BDBM50114842 CHEMBL3608390
SMILES: COc1cc(cnc1-n1cnc(C)c1)-c1cn(nn1)[C@H]1CCc2c(F)cccc2N(CC(F)(F)F)C1=O
InChI Key: InChIKey=XATMGDHWHJHERK-FQEVSTJZSA-N
Data: 2 IC50
Activity Spreadsheet -- Enzyme Inhibition Constant Data from BindingDB
Found 2 hits for monomerid = 50114842
Trg + Lig
Ki
nM
ΔG°
kcal/mole
IC50
nM
Kd
nM
EC50/IC50
nM
koff
s-1
kon
M-1s-1
pHTemp
°C
Gamma-Secretase Subunit APH-1A/Gamma-Secretase Subunit PEN-2/Gamma-Secretase Subunit Presenilin-1/Gamma-secretase subunit APH-1B/Nicastrin /Presenilin 2
(Homo sapiens (Human))
BDBM50114842
(CHEMBL3608390)
Show SMILES COc1cc(cnc1-n1cnc(C)c1)-c1cn(nn1)[C@H]1CCc2c(F)cccc2N(CC(F)(F)F)C1=O |r|
Show InChI InChI=1S/C24H21F4N7O2/c1-14-10-33(13-30-14)22-21(37-2)8-15(9-29-22)18-11-35(32-31-18)20-7-6-16-17(25)4-3-5-19(16)34(23(20)36)12-24(26,27)28/h3-5,8-11,13,20H,6-7,12H2,1-2H3/t20-/m0/s1
n/an/a 29n/an/an/an/an/an/a
Merck Research Laboratories
Curated by ChEMBL
Assay Description
Modulation of gamma-secretase in human SH-SY5Y cells overexpressing APP C-terminal fragment SPA4CT assessed as inhibition of intracellular amyloid be...
Bioorg Med Chem Lett 25: 3495-500 (2015)
BindingDB Entry DOI: 10.7270/Q2125VFP
Gamma-Secretase Subunit APH-1A/Gamma-Secretase Subunit PEN-2/Gamma-Secretase Subunit Presenilin-1/Gamma-secretase subunit APH-1B/Nicastrin /Presenilin 2
(Homo sapiens (Human))
BDBM50114842
(CHEMBL3608390)
Show SMILES COc1cc(cnc1-n1cnc(C)c1)-c1cn(nn1)[C@H]1CCc2c(F)cccc2N(CC(F)(F)F)C1=O |r|
Show InChI InChI=1S/C24H21F4N7O2/c1-14-10-33(13-30-14)22-21(37-2)8-15(9-29-22)18-11-35(32-31-18)20-7-6-16-17(25)4-3-5-19(16)34(23(20)36)12-24(26,27)28/h3-5,8-11,13,20H,6-7,12H2,1-2H3/t20-/m0/s1
n/an/a 170n/an/an/an/an/an/a
Merck Research Laboratories
Curated by ChEMBL
Assay Description
Modulation of gamma-secretase in human SH-SY5Y cells overexpressing APP C-terminal fragment SPA4CT assessed as inhibition of intracellular amyloid be...
Bioorg Med Chem Lett 25: 3495-500 (2015)
BindingDB Entry DOI: 10.7270/Q2125VFP