BDBM50114904 (3R,5S)-5-(5-Cyclopropylmethylsulfanyl-4-phenyl-4H-[1,2,4]triazol-3-yl)-1-(naphthalene-2-sulfonyl)-pyrrolidine-3-thiol::CHEMBL47934
SMILES: S[C@@H]1C[C@H](N(C1)S(=O)(=O)c1ccc2ccccc2c1)c1nnc(SCC2CC2)n1-c1ccccc1
InChI Key: InChIKey=YDUUJOJYIGBFCP-VWNXMTODSA-N
Data: 1 IC50
Activity Spreadsheet -- Enzyme Inhibition Constant Data from BindingDB
Found 1 hit for monomerid = 50114904
Trg + Lig
Ki
nM
ΔG°
kcal/mole
IC50
nM
Kd
nM
EC50/IC50
nM
koff
s-1
kon
M-1s-1
pHTemp
°C
Endothelin-converting enzyme 1 (ECE1)
(Homo sapiens (Human))
BDBM50114904
((3R,5S)-5-(5-Cyclopropylmethylsulfanyl-4-phenyl-4H...)
Show SMILES S[C@@H]1C[C@H](N(C1)S(=O)(=O)c1ccc2ccccc2c1)c1nnc(SCC2CC2)n1-c1ccccc1
Show InChI InChI=1S/C26H26N4O2S3/c31-35(32,23-13-12-19-6-4-5-7-20(19)14-23)29-16-22(33)15-24(29)25-27-28-26(34-17-18-10-11-18)30(25)21-8-2-1-3-9-21/h1-9,12-14,18,22,24,33H,10-11,15-17H2/t22-,24+/m1/s1
n/an/a 700n/an/an/an/an/an/a
F. Hoffmann-La Roche Ltd.
Curated by ChEMBL
Assay Description
Tested for inhibitory concentration against human Endothelin-converting enzyme 1 at 10 microM
Bioorg Med Chem Lett 12: 1727-30 (2002)
BindingDB Entry DOI: 10.7270/Q2XP748S