BDBM50114907 (3R,5S)-1-(4-Fluoro-benzenesulfonyl)-5-(5-methylsulfanyl-4-phenyl-4H-[1,2,4]triazol-3-yl)-pyrrolidine-3-thiol::CHEMBL296371
SMILES: CSc1nnc([C@@H]2C[C@@H](S)CN2S(=O)(=O)c2ccc(F)cc2)n1-c1ccccc1
InChI Key: InChIKey=GQNAHJDQIXSACD-WBVHZDCISA-N
Data: 1 IC50
Activity Spreadsheet -- Enzyme Inhibition Constant Data from BindingDB
Found 1 hit for monomerid = 50114907
Trg + Lig
Ki
nM
ΔG°
kcal/mole
IC50
nM
Kd
nM
EC50/IC50
nM
koff
s-1
kon
M-1s-1
pHTemp
°C
Endothelin-converting enzyme 1 (ECE1)
(Homo sapiens (Human))
BDBM50114907
((3R,5S)-1-(4-Fluoro-benzenesulfonyl)-5-(5-methylsu...)
Show SMILES CSc1nnc([C@@H]2C[C@@H](S)CN2S(=O)(=O)c2ccc(F)cc2)n1-c1ccccc1
Show InChI InChI=1S/C19H19FN4O2S3/c1-28-19-22-21-18(24(19)14-5-3-2-4-6-14)17-11-15(27)12-23(17)29(25,26)16-9-7-13(20)8-10-16/h2-10,15,17,27H,11-12H2,1H3/t15-,17+/m1/s1
n/an/a 8.95E+3n/an/an/an/an/an/a
F. Hoffmann-La Roche Ltd.
Curated by ChEMBL
Assay Description
Tested for inhibitory concentration against human Endothelin-converting enzyme 1 at 10 microM
Bioorg Med Chem Lett 12: 1727-30 (2002)
BindingDB Entry DOI: 10.7270/Q2XP748S