BDBM50115216 1-(1-(3-Aminophenyl)-3-tert-butyl-1H-pyrazol-5-yl)-3-phenylurea, 1b::1-(1-(3-aminophenyl)-3-tert-butyl-1H-pyrazol-5-yl)-3-phenylurea::1-[1-(3-aminophenyl)-3-tert-butyl-1H-pyrazol-5-yl]-3-phenylurea::1-[2-(3-Amino-phenyl)-5-tert-butyl-2H-pyrazol-3-yl]-3-phenyl-urea::CHEMBL87580
SMILES: CC(C)(C)c1cc(NC(=O)Nc2ccccc2)n(n1)-c1cccc(N)c1
InChI Key: InChIKey=DHNYNLNKNQJSHF-UHFFFAOYSA-N
Data: 3 IC50  3 Kd  1 Other
PDB links: 1 PDB ID matches this monomer.
Activity Spreadsheet -- Enzyme Inhibition Constant Data from BindingDB
Found 7 hits for monomerid = 50115216
Trg + Lig
Ki
nM
ΔG°
kcal/mole
IC50
nM
Kd
nM
EC50/IC50
nM
koff
s-1
kon
M-1s-1
pHTemp
°C
Proto-oncogene tyrosine-protein kinase Src
(Gallus gallus (Chicken))
BDBM50115216
(1-(1-(3-Aminophenyl)-3-tert-butyl-1H-pyrazol-5-yl)...)
Show SMILES CC(C)(C)c1cc(NC(=O)Nc2ccccc2)n(n1)-c1cccc(N)c1
Show InChI InChI=1S/C20H23N5O/c1-20(2,3)17-13-18(23-19(26)22-15-9-5-4-6-10-15)25(24-17)16-11-7-8-14(21)12-16/h4-13H,21H2,1-3H3,(H2,22,23,26)
n/an/an/an/an/an/an/an/an/a
Chemical Genomics Centre of the Max Planck Society
Assay Description
Tyrosine kinase inhibition assay using wild type cSrc measured by a fluorescence-labeled approach.
Nat Chem Biol 5: 394-6 (2009)
Article DOI: 10.1038/nchembio.162
BindingDB Entry DOI: 10.7270/Q20V8B46
3D
3D Structure (crystal)
Mitogen-activated protein kinase 14
(Homo sapiens (Human))
BDBM50115216
(1-(1-(3-Aminophenyl)-3-tert-butyl-1H-pyrazol-5-yl)...)
Show SMILES CC(C)(C)c1cc(NC(=O)Nc2ccccc2)n(n1)-c1cccc(N)c1
Show InChI InChI=1S/C20H23N5O/c1-20(2,3)17-13-18(23-19(26)22-15-9-5-4-6-10-15)25(24-17)16-11-7-8-14(21)12-16/h4-13H,21H2,1-3H3,(H2,22,23,26)
NCI pathway
Reactome pathway
n/an/an/a 197n/an/an/an/an/a
Chemical Genomics Centre of the Max Planck Society
Assay Description
Serine/threonine kinase inhibition assay using MAP p38 alpha fluorescence-labeled approach.
Nat Chem Biol 5: 394-6 (2009)
Article DOI: 10.1038/nchembio.162
BindingDB Entry DOI: 10.7270/Q20V8B46
Discoidin domain-containing receptor 2
(Homo sapiens (Human))
BDBM50115216
(1-(1-(3-Aminophenyl)-3-tert-butyl-1H-pyrazol-5-yl)...)
Show SMILES CC(C)(C)c1cc(NC(=O)Nc2ccccc2)n(n1)-c1cccc(N)c1
Show InChI InChI=1S/C20H23N5O/c1-20(2,3)17-13-18(23-19(26)22-15-9-5-4-6-10-15)25(24-17)16-11-7-8-14(21)12-16/h4-13H,21H2,1-3H3,(H2,22,23,26)
Reactome pathway
n/an/a 9.41E+3n/an/an/an/an/an/a
Technical University of Dortmund
Curated by ChEMBL
Assay Description
Inhibition of wild type DDR2 (unknown origin) preincubated for 30 mins before substrate addition by FRET assay
J Med Chem 57: 4252-62 (2014)
Article DOI: 10.1021/jm500167q
BindingDB Entry DOI: 10.7270/Q2Z039P4
Mitogen-activated protein kinase 14
(Homo sapiens (Human))
BDBM50115216
(1-(1-(3-Aminophenyl)-3-tert-butyl-1H-pyrazol-5-yl)...)
Show SMILES CC(C)(C)c1cc(NC(=O)Nc2ccccc2)n(n1)-c1cccc(N)c1
Show InChI InChI=1S/C20H23N5O/c1-20(2,3)17-13-18(23-19(26)22-15-9-5-4-6-10-15)25(24-17)16-11-7-8-14(21)12-16/h4-13H,21H2,1-3H3,(H2,22,23,26)
NCI pathway
Reactome pathway
n/an/a 440n/an/an/an/an/an/a
Chemical Genomics Centre of the Max Planck Society
Curated by ChEMBL
Assay Description
Displacemnt of N,N'-(2,2'-(3,3'-disulfanediylbis(2,5-dioxopyrrolidine-3,1-diyl))bis(ethane-2,1-diyl))bis(2-(3-(3-tert-butyl-5-(3-naphthalen-1-ylureid...
J Med Chem 53: 357-67 (2010)
Article DOI: 10.1021/jm901297e
BindingDB Entry DOI: 10.7270/Q29W0FKC
Mitogen-activated protein kinase 14
(Homo sapiens (Human))
BDBM50115216
(1-(1-(3-Aminophenyl)-3-tert-butyl-1H-pyrazol-5-yl)...)
Show SMILES CC(C)(C)c1cc(NC(=O)Nc2ccccc2)n(n1)-c1cccc(N)c1
Show InChI InChI=1S/C20H23N5O/c1-20(2,3)17-13-18(23-19(26)22-15-9-5-4-6-10-15)25(24-17)16-11-7-8-14(21)12-16/h4-13H,21H2,1-3H3,(H2,22,23,26)
NCI pathway
Reactome pathway
n/an/an/a 197n/an/an/an/an/a
Chemical Genomics Centre of the Max Planck Society
Curated by ChEMBL
Assay Description
Binding affinity to p38alpha
J Med Chem 53: 357-67 (2010)
Article DOI: 10.1021/jm901297e
BindingDB Entry DOI: 10.7270/Q29W0FKC
Mitogen-activated protein kinase 14
(Homo sapiens (Human))
BDBM50115216
(1-(1-(3-Aminophenyl)-3-tert-butyl-1H-pyrazol-5-yl)...)
Show SMILES CC(C)(C)c1cc(NC(=O)Nc2ccccc2)n(n1)-c1cccc(N)c1
Show InChI InChI=1S/C20H23N5O/c1-20(2,3)17-13-18(23-19(26)22-15-9-5-4-6-10-15)25(24-17)16-11-7-8-14(21)12-16/h4-13H,21H2,1-3H3,(H2,22,23,26)
NCI pathway
Reactome pathway
n/an/a 1.10E+3n/an/an/an/an/an/a
Chemical Genomics Centre of the Max Planck Society
Curated by ChEMBL
Assay Description
Inhibition of p38alpha active form expressed in Escherichia coli BL21(DE3) cells by HTRF assay
J Med Chem 53: 357-67 (2010)
Article DOI: 10.1021/jm901297e
BindingDB Entry DOI: 10.7270/Q29W0FKC
Discoidin domain-containing receptor 2
(Homo sapiens (Human))
BDBM50115216
(1-(1-(3-Aminophenyl)-3-tert-butyl-1H-pyrazol-5-yl)...)
Show SMILES CC(C)(C)c1cc(NC(=O)Nc2ccccc2)n(n1)-c1cccc(N)c1
Show InChI InChI=1S/C20H23N5O/c1-20(2,3)17-13-18(23-19(26)22-15-9-5-4-6-10-15)25(24-17)16-11-7-8-14(21)12-16/h4-13H,21H2,1-3H3,(H2,22,23,26)
Reactome pathway
n/an/an/a>1.00E+3n/an/an/an/an/a
Technical University of Dortmund
Curated by ChEMBL
Assay Description
Binding affinity to human acrylodan-labeled N-terminal His-tagged DDR2 (558 to 855 aa) by FLiK assay
J Med Chem 57: 4252-62 (2014)
Article DOI: 10.1021/jm500167q
BindingDB Entry DOI: 10.7270/Q2Z039P4