null
SMILES: [#6]-c1ccnc2-[#6]-[#6](-[#6]-[#6](=[#7]\[#7]=[#6](\[#7])-[#7])-c12)-c1cccc(Cl)c1
InChI Key: InChIKey=PKAZWDJMPIVCMK-UHFFFAOYSA-N
Activity Spreadsheet -- Enzyme Inhibition Constant Data from BindingDB
Found 1 hit for monomerid = 50115229
Trg + Lig
Ki
nM
ΔG°
kcal/mole
IC50
nM
Kd
nM
EC50/IC50
nM
koff
s-1
kon
M-1s-1
pHTemp
°C
Sodium/hydrogen exchanger 1
(Rattus norvegicus)
BDBM50115229
(CHEMBL553754 | N-[7-(3-chlorophenyl)-4-methyl-5,6,...)
Show SMILES [#6]-c1ccnc2-[#6]-[#6](-[#6]-[#6](=[#7]\[#7]=[#6](\[#7])-[#7])-c12)-c1cccc(Cl)c1 |w:10.10|
Show InChI InChI=1S/C17H18ClN5/c1-10-5-6-21-14-8-12(11-3-2-4-13(18)7-11)9-15(16(10)14)22-23-17(19)20/h2-7,12H,8-9H2,1H3,(H4,19,20,23)
Reactome pathway
n/an/a 61n/an/an/an/an/an/a
Takeda Chemical Industries, Ltd.
Curated by ChEMBL
Assay Description
In vitro inhibition of acid induced swelling in rat platelets by 50% as a measure of NHE-1 inhibition
J Med Chem 45: 3009-21 (2002)
BindingDB Entry DOI: 10.7270/Q2V40VZN