null
SMILES: [#6]-c1ccnc2-[#6]-[#6@H](-[#6]-[#6](=[#7]\[#7]=[#6](\[#7])-[#7])-c12)-c1cc(Cl)sc1Cl
InChI Key: InChIKey=OVLZDIIQANTFTO-MRVPVSSYSA-N
Activity Spreadsheet -- Enzyme Inhibition Constant Data from BindingDB
Found 1 hit for monomerid = 50115239
Trg + Lig
Ki
nM
ΔG°
kcal/mole
IC50
nM
Kd
nM
EC50/IC50
nM
koff
s-1
kon
M-1s-1
pHTemp
°C
Sodium/hydrogen exchanger 1
(Rattus norvegicus)
BDBM50115239
((S)-N-[7-(2,5-dichloro-3-thienyl)-4-methyl-(7S)-5,...)
Show SMILES [#6]-c1ccnc2-[#6]-[#6@H](-[#6]-[#6](=[#7]\[#7]=[#6](\[#7])-[#7])-c12)-c1cc(Cl)sc1Cl |w:10.10|
Show InChI InChI=1S/C15H15Cl2N5S/c1-7-2-3-20-10-4-8(9-6-12(16)23-14(9)17)5-11(13(7)10)21-22-15(18)19/h2-3,6,8H,4-5H2,1H3,(H4,18,19,22)/t8-/m1/s1
Reactome pathway
n/an/a 17n/an/an/an/an/an/a
Takeda Chemical Industries, Ltd.
Curated by ChEMBL
Assay Description
In vitro inhibition of acid induced swelling in rat platelets by 50% as a measure of NHE-1 inhibition
J Med Chem 45: 3009-21 (2002)
BindingDB Entry DOI: 10.7270/Q2V40VZN