null
SMILES: [#6]-c1ccnc2-[#6]-[#6](-[#6]-[#6](=[#7]\[#7]=[#6](\[#7])-[#7])-c12)-c1cc(Cl)ccc1Cl
InChI Key: InChIKey=KZFQEBBSZPJRLL-UHFFFAOYSA-N
Activity Spreadsheet -- Enzyme Inhibition Constant Data from BindingDB
Found 1 hit for monomerid = 50115255
Trg + Lig
Ki
nM
ΔG°
kcal/mole
IC50
nM
Kd
nM
EC50/IC50
nM
koff
s-1
kon
M-1s-1
pHTemp
°C
Sodium/hydrogen exchanger 1
(Rattus norvegicus)
BDBM50115255
(CHEMBL540813 | N-[7-(2,5-dichlorophenyl)-4-methyl-...)
Show SMILES [#6]-c1ccnc2-[#6]-[#6](-[#6]-[#6](=[#7]\[#7]=[#6](\[#7])-[#7])-c12)-c1cc(Cl)ccc1Cl |w:10.10|
Show InChI InChI=1S/C17H17Cl2N5/c1-9-4-5-22-14-6-10(12-8-11(18)2-3-13(12)19)7-15(16(9)14)23-24-17(20)21/h2-5,8,10H,6-7H2,1H3,(H4,20,21,24)
Reactome pathway
n/an/a 58n/an/an/an/an/an/a
Takeda Chemical Industries, Ltd.
Curated by ChEMBL
Assay Description
In vitro inhibition of acid induced swelling in rat platelets by 50% as a measure of NHE-1 inhibition
J Med Chem 45: 3009-21 (2002)
BindingDB Entry DOI: 10.7270/Q2V40VZN