null
SMILES: [#6]-c1ccc(F)cc1-[#6]-1-[#6]-[#6](=[#7]\[#7]=[#6](\[#7])-[#7])-c2c(-[#6])ccnc2-[#6]-1
InChI Key: InChIKey=LANOLOBXTHGFCJ-UHFFFAOYSA-N
Activity Spreadsheet -- Enzyme Inhibition Constant Data from BindingDB
Found 1 hit for monomerid = 50115258
Trg + Lig
Ki
nM
ΔG°
kcal/mole
IC50
nM
Kd
nM
EC50/IC50
nM
koff
s-1
kon
M-1s-1
pHTemp
°C
Sodium/hydrogen exchanger 1
(Rattus norvegicus)
BDBM50115258
(CHEMBL555535 | N-[7-(5-fluoro-2-methylphenyl)-4-me...)
Show SMILES [#6]-c1ccc(F)cc1-[#6]-1-[#6]-[#6](=[#7]\[#7]=[#6](\[#7])-[#7])-c2c(-[#6])ccnc2-[#6]-1 |w:11.12|
Show InChI InChI=1S/C18H20FN5/c1-10-3-4-13(19)9-14(10)12-7-15-17(11(2)5-6-22-15)16(8-12)23-24-18(20)21/h3-6,9,12H,7-8H2,1-2H3,(H4,20,21,24)
Reactome pathway
n/an/a 37n/an/an/an/an/an/a
Takeda Chemical Industries, Ltd.
Curated by ChEMBL
Assay Description
In vitro inhibition of acid induced swelling in rat platelets by 50% as a measure of NHE-1 inhibition
J Med Chem 45: 3009-21 (2002)
BindingDB Entry DOI: 10.7270/Q2V40VZN