BDBM50115314 4-(6,7-Dimethoxy-quinazolin-4-yl)-piperazine-1-carboxylic acid (2-nitro-phenyl)-amide::CHEMBL105689
SMILES: COc1cc2ncnc(N3CCN(CC3)C(=O)Nc3ccccc3[N+]([O-])=O)c2cc1OC
InChI Key: InChIKey=DJCXBGBTOUKRNR-UHFFFAOYSA-N
Data: 1 IC50
Activity Spreadsheet -- Enzyme Inhibition Constant Data from BindingDB
Found 1 hit for monomerid = 50115314
Trg + Lig
Ki
nM
ΔG°
kcal/mole
IC50
nM
Kd
nM
EC50/IC50
nM
koff
s-1
kon
M-1s-1
pHTemp
°C
Platelet-derived growth factor receptor beta
(Homo sapiens (Human))
BDBM50115314
(4-(6,7-Dimethoxy-quinazolin-4-yl)-piperazine-1-car...)
Show SMILES COc1cc2ncnc(N3CCN(CC3)C(=O)Nc3ccccc3[N+]([O-])=O)c2cc1OC
Show InChI InChI=1S/C21H22N6O5/c1-31-18-11-14-16(12-19(18)32-2)22-13-23-20(14)25-7-9-26(10-8-25)21(28)24-15-5-3-4-6-17(15)27(29)30/h3-6,11-13H,7-10H2,1-2H3,(H,24,28)
NCI pathway
Reactome pathway
n/an/a>3.00E+4n/an/an/an/an/an/a
Pharmaceutical Research Institute
Curated by ChEMBL
Assay Description
Inhibition of Platelet-derived growth factor receptor beta phosphorylation
J Med Chem 45: 3057-66 (2002)
BindingDB Entry DOI: 10.7270/Q2RX9BDP