BDBM50115328 4-{[4-(6,7-Dimethoxy-quinazolin-4-yl)-piperazine-1-carbonyl]-amino}-benzoic acid::CHEMBL106967
SMILES: COc1cc2ncnc(N3CCN(CC3)C(=O)Nc3ccc(cc3)C(O)=O)c2cc1OC
InChI Key: InChIKey=GVGODJHCCDANKD-UHFFFAOYSA-N
Data: 1 IC50
Activity Spreadsheet -- Enzyme Inhibition Constant Data from BindingDB
Found 1 hit for monomerid = 50115328
Trg + Lig
Ki
nM
ΔG°
kcal/mole
IC50
nM
Kd
nM
EC50/IC50
nM
koff
s-1
kon
M-1s-1
pHTemp
°C
Platelet-derived growth factor receptor beta
(Homo sapiens (Human))
BDBM50115328
(4-{[4-(6,7-Dimethoxy-quinazolin-4-yl)-piperazine-1...)
Show SMILES COc1cc2ncnc(N3CCN(CC3)C(=O)Nc3ccc(cc3)C(O)=O)c2cc1OC
Show InChI InChI=1S/C22H23N5O5/c1-31-18-11-16-17(12-19(18)32-2)23-13-24-20(16)26-7-9-27(10-8-26)22(30)25-15-5-3-14(4-6-15)21(28)29/h3-6,11-13H,7-10H2,1-2H3,(H,25,30)(H,28,29)
NCI pathway
Reactome pathway
n/an/a>3.00E+4n/an/an/an/an/an/a
Pharmaceutical Research Institute
Curated by ChEMBL
Assay Description
Inhibition of Platelet-derived growth factor receptor beta phosphorylation
J Med Chem 45: 3057-66 (2002)
BindingDB Entry DOI: 10.7270/Q2RX9BDP