BDBM50115330 4-(6,7-Dimethoxy-quinazolin-4-yl)-piperazine-1-carboxylic acid [4-(pyridin-4-yloxy)-phenyl]-amide::CHEMBL102427
SMILES: COc1cc2ncnc(N3CCN(CC3)C(=O)Nc3ccc(Oc4ccncc4)cc3)c2cc1OC
InChI Key: InChIKey=RITNZSZSGUPIDZ-UHFFFAOYSA-N
Data: 1 IC50
Activity Spreadsheet -- Enzyme Inhibition Constant Data from BindingDB
Found 1 hit for monomerid = 50115330
Trg + Lig
Ki
nM
ΔG°
kcal/mole
IC50
nM
Kd
nM
EC50/IC50
nM
koff
s-1
kon
M-1s-1
pHTemp
°C
Platelet-derived growth factor receptor beta
(Homo sapiens (Human))
BDBM50115330
(4-(6,7-Dimethoxy-quinazolin-4-yl)-piperazine-1-car...)
Show SMILES COc1cc2ncnc(N3CCN(CC3)C(=O)Nc3ccc(Oc4ccncc4)cc3)c2cc1OC
Show InChI InChI=1S/C26H26N6O4/c1-34-23-15-21-22(16-24(23)35-2)28-17-29-25(21)31-11-13-32(14-12-31)26(33)30-18-3-5-19(6-4-18)36-20-7-9-27-10-8-20/h3-10,15-17H,11-14H2,1-2H3,(H,30,33)
NCI pathway
Reactome pathway
n/an/a 2.31E+3n/an/an/an/an/an/a
Pharmaceutical Research Institute
Curated by ChEMBL
Assay Description
Inhibition of Platelet-derived growth factor receptor beta phosphorylation
J Med Chem 45: 3057-66 (2002)
BindingDB Entry DOI: 10.7270/Q2RX9BDP