BDBM50115342 4-(6,7-Dimethoxy-quinazolin-4-yl)-piperazine-1-carboxylic acid (4-benzyloxy-phenyl)-amide::CHEMBL441272
SMILES: COc1cc2ncnc(N3CCN(CC3)C(=O)Nc3ccc(OCc4ccccc4)cc3)c2cc1OC
InChI Key: InChIKey=ZRBCVQXHRKQXPM-UHFFFAOYSA-N
Data: 1 IC50
Activity Spreadsheet -- Enzyme Inhibition Constant Data from BindingDB
Found 1 hit for monomerid = 50115342
Trg + Lig
Ki
nM
ΔG°
kcal/mole
IC50
nM
Kd
nM
EC50/IC50
nM
koff
s-1
kon
M-1s-1
pHTemp
°C
Platelet-derived growth factor receptor beta
(Homo sapiens (Human))
BDBM50115342
(4-(6,7-Dimethoxy-quinazolin-4-yl)-piperazine-1-car...)
Show SMILES COc1cc2ncnc(N3CCN(CC3)C(=O)Nc3ccc(OCc4ccccc4)cc3)c2cc1OC
Show InChI InChI=1S/C28H29N5O4/c1-35-25-16-23-24(17-26(25)36-2)29-19-30-27(23)32-12-14-33(15-13-32)28(34)31-21-8-10-22(11-9-21)37-18-20-6-4-3-5-7-20/h3-11,16-17,19H,12-15,18H2,1-2H3,(H,31,34)
NCI pathway
Reactome pathway
n/an/a 290n/an/an/an/an/an/a
Pharmaceutical Research Institute
Curated by ChEMBL
Assay Description
Inhibition of Platelet-derived growth factor receptor beta phosphorylation
J Med Chem 45: 3057-66 (2002)
BindingDB Entry DOI: 10.7270/Q2RX9BDP