BDBM50115353 4-(6,7-Dimethoxy-quinazolin-4-yl)-piperazine-1-carbothioic acid (3-chloro-phenyl)-amide::CHEMBL103012
SMILES: COc1cc2ncnc(N3CCN(CC3)C(=S)Nc3cccc(Cl)c3)c2cc1OC
InChI Key: InChIKey=WRVCEMQBWLVDCT-UHFFFAOYSA-N
Data: 1 IC50
Activity Spreadsheet -- Enzyme Inhibition Constant Data from BindingDB
Found 1 hit for monomerid = 50115353
Trg + Lig
Ki
nM
ΔG°
kcal/mole
IC50
nM
Kd
nM
EC50/IC50
nM
koff
s-1
kon
M-1s-1
pHTemp
°C
Platelet-derived growth factor receptor beta
(Homo sapiens (Human))
BDBM50115353
(4-(6,7-Dimethoxy-quinazolin-4-yl)-piperazine-1-car...)
Show SMILES COc1cc2ncnc(N3CCN(CC3)C(=S)Nc3cccc(Cl)c3)c2cc1OC
Show InChI InChI=1S/C21H22ClN5O2S/c1-28-18-11-16-17(12-19(18)29-2)23-13-24-20(16)26-6-8-27(9-7-26)21(30)25-15-5-3-4-14(22)10-15/h3-5,10-13H,6-9H2,1-2H3,(H,25,30)
NCI pathway
Reactome pathway
n/an/a 440n/an/an/an/an/an/a
Pharmaceutical Research Institute
Curated by ChEMBL
Assay Description
Inhibition of Platelet-derived growth factor receptor beta phosphorylation
J Med Chem 45: 3057-66 (2002)
BindingDB Entry DOI: 10.7270/Q2RX9BDP