BDBM50115404 CHEMBL3608590
SMILES: CC(C)Nc1nccc(n1)-c1cc2C(=O)N(Cc3ccccc3)CCn2c1
InChI Key: InChIKey=DXLFCNCRKRXJJA-UHFFFAOYSA-N
Data: 1 IC50
Activity Spreadsheet -- Enzyme Inhibition Constant Data from BindingDB
Found 1 hit for monomerid = 50115404
Trg + Lig
Ki
nM
ΔG°
kcal/mole
IC50
nM
Kd
nM
EC50/IC50
nM
koff
s-1
kon
M-1s-1
pHTemp
°C
Mitogen-activated protein kinase 1
(Homo sapiens (Human))
BDBM50115404
(CHEMBL3608590)
Show SMILES CC(C)Nc1nccc(n1)-c1cc2C(=O)N(Cc3ccccc3)CCn2c1
Show InChI InChI=1S/C21H23N5O/c1-15(2)23-21-22-9-8-18(24-21)17-12-19-20(27)26(11-10-25(19)14-17)13-16-6-4-3-5-7-16/h3-9,12,14-15H,10-11,13H2,1-2H3,(H,22,23,24)
NCI pathway
Reactome pathway
n/an/a 76n/an/an/an/an/an/a
Novartis Institutes for BioMedical Research
Curated by ChEMBL
Assay Description
Inhibition of ERK2 (unknown origin)
Bioorg Med Chem Lett 25: 3788-92 (2015)
BindingDB Entry DOI: 10.7270/Q2G44S3Q