null
SMILES: NC(=N)c1ccc(CNC(=O)CNC(=O)[C@@H](Cc2ccccc2)NS(=O)(=O)Cc2ccccc2)cc1
InChI Key: InChIKey=BHPZMFXUQRHXSO-HSZRJFAPSA-N
PDB links: 1 PDB ID matches this monomer.
Activity Spreadsheet -- Enzyme Inhibition Constant Data from BindingDB
Found 2 hits for monomerid = 50115492
Trg + Lig
Ki
nM
ΔG°
kcal/mole
IC50
nM
Kd
nM
EC50/IC50
nM
koff
s-1
kon
M-1s-1
pHTemp
°C
Prothrombin
(Homo sapiens (Human))
BDBM50115492
(CHEMBL3608989)
Show SMILES NC(=N)c1ccc(CNC(=O)CNC(=O)[C@@H](Cc2ccccc2)NS(=O)(=O)Cc2ccccc2)cc1 |r|
Show InChI InChI=1S/C26H29N5O4S/c27-25(28)22-13-11-20(12-14-22)16-29-24(32)17-30-26(33)23(15-19-7-3-1-4-8-19)31-36(34,35)18-21-9-5-2-6-10-21/h1-14,23,31H,15-18H2,(H3,27,28)(H,29,32)(H,30,33)/t23-/m1/s1
140n/an/an/an/an/an/an/an/a
Philipps-University Marburg
Curated by ChEMBL
Assay Description
Binding affinity to thrombin (unknown origin)
J Med Chem 58: 6960-71 (2015)
BindingDB Entry DOI: 10.7270/Q26M38M6
Prothrombin
(Homo sapiens (Human))
BDBM50115492
(CHEMBL3608989)
Show SMILES NC(=N)c1ccc(CNC(=O)CNC(=O)[C@@H](Cc2ccccc2)NS(=O)(=O)Cc2ccccc2)cc1 |r|
Show InChI InChI=1S/C26H29N5O4S/c27-25(28)22-13-11-20(12-14-22)16-29-24(32)17-30-26(33)23(15-19-7-3-1-4-8-19)31-36(34,35)18-21-9-5-2-6-10-21/h1-14,23,31H,15-18H2,(H3,27,28)(H,29,32)(H,30,33)/t23-/m1/s1
n/an/an/a 160n/an/an/an/an/a
Philipps-University Marburg
Curated by ChEMBL
Assay Description
Binding affinity to thrombin (unknown origin) by direct isothermal titration colorimetry
J Med Chem 58: 6960-71 (2015)
BindingDB Entry DOI: 10.7270/Q26M38M6