BDBM50115917 4-[3-(4-Cyano-benzyl)-3H-imidazol-4-ylmethyl]-piperazine-1-carboxylic acid benzo[1,3]dioxol-4-ylmethyl ester::CHEMBL305138
SMILES: O=C(OCc1cccc2OCOc12)N1CCN(Cc2cncn2Cc2ccc(cc2)C#N)CC1
InChI Key: InChIKey=VKLQBYODSYOXOK-UHFFFAOYSA-N
Data: 3 IC50
Activity Spreadsheet -- Enzyme Inhibition Constant Data from BindingDB
Found 3 hits for monomerid = 50115917
Trg + Lig
Ki
nM
ΔG°
kcal/mole
IC50
nM
Kd
nM
EC50/IC50
nM
koff
s-1
kon
M-1s-1
pHTemp
°C
Protein Farnesyltransferase (PFT)
(Homo sapiens (Human))
BDBM50115917
(4-[3-(4-Cyano-benzyl)-3H-imidazol-4-ylmethyl]-pipe...)
Show SMILES O=C(OCc1cccc2OCOc12)N1CCN(Cc2cncn2Cc2ccc(cc2)C#N)CC1
Show InChI InChI=1S/C25H25N5O4/c26-12-19-4-6-20(7-5-19)14-30-17-27-13-22(30)15-28-8-10-29(11-9-28)25(31)32-16-21-2-1-3-23-24(21)34-18-33-23/h1-7,13,17H,8-11,14-16,18H2
Reactome pathway
n/an/a 16n/an/an/an/an/an/a
Merck Research Laboratories
Curated by ChEMBL
Assay Description
Inhibitor of Farnesyl protein transferase(FTPase) required to reduce radiolabel [1-3H] incorporation by 50%
Bioorg Med Chem Lett 12: 2027-30 (2002)
BindingDB Entry DOI: 10.7270/Q2TQ60VS
Geranylgeranyl transferase type I beta subunit/Protein Farnesyltransferase (PFT)
(Homo sapiens (Human))
BDBM50115917
(4-[3-(4-Cyano-benzyl)-3H-imidazol-4-ylmethyl]-pipe...)
Show SMILES O=C(OCc1cccc2OCOc12)N1CCN(Cc2cncn2Cc2ccc(cc2)C#N)CC1
Show InChI InChI=1S/C25H25N5O4/c26-12-19-4-6-20(7-5-19)14-30-17-27-13-22(30)15-28-8-10-29(11-9-28)25(31)32-16-21-2-1-3-23-24(21)34-18-33-23/h1-7,13,17H,8-11,14-16,18H2
n/an/a 20n/an/an/an/an/an/a
Merck Research Laboratories
Curated by ChEMBL
Assay Description
Inhibition of [1-3H]-GGPP incorporation into biotinylated K4B-Ras peptide by geranylgeranyl transferase in the presence of 5 mM ATP
Bioorg Med Chem Lett 12: 2027-30 (2002)
BindingDB Entry DOI: 10.7270/Q2TQ60VS
Protein Farnesyltransferase (PFT)
(Homo sapiens (Human))
BDBM50115917
(4-[3-(4-Cyano-benzyl)-3H-imidazol-4-ylmethyl]-pipe...)
Show SMILES O=C(OCc1cccc2OCOc12)N1CCN(Cc2cncn2Cc2ccc(cc2)C#N)CC1
Show InChI InChI=1S/C25H25N5O4/c26-12-19-4-6-20(7-5-19)14-30-17-27-13-22(30)15-28-8-10-29(11-9-28)25(31)32-16-21-2-1-3-23-24(21)34-18-33-23/h1-7,13,17H,8-11,14-16,18H2
Reactome pathway
n/an/a 11n/an/an/an/an/an/a
Merck Research Laboratories
Curated by ChEMBL
Assay Description
The concentration required to displace 50% of a highly potent radiolabeled FPTase inhibitor
Bioorg Med Chem Lett 12: 2027-30 (2002)
BindingDB Entry DOI: 10.7270/Q2TQ60VS