BDBM50115928 4-[3-(4-Cyano-benzyl)-3H-imidazol-4-ylmethyl]-piperazine-1-carboxylic acid 2-(2,2,2-trifluoro-ethyl)-benzyl ester::CHEMBL59963
SMILES: FC(F)(F)Cc1ccccc1COC(=O)N1CCN(Cc2cncn2Cc2ccc(cc2)C#N)CC1
InChI Key: InChIKey=ASUWZCFQGVUVGX-UHFFFAOYSA-N
Data: 3 IC50  1 EC50
Activity Spreadsheet -- Enzyme Inhibition Constant Data from BindingDB
Found 4 hits for monomerid = 50115928
Trg + Lig
Ki
nM
ΔG°
kcal/mole
IC50
nM
Kd
nM
EC50/IC50
nM
koff
s-1
kon
M-1s-1
pHTemp
°C
Protein Farnesyltransferase (PFT)
(Homo sapiens (Human))
BDBM50115928
(4-[3-(4-Cyano-benzyl)-3H-imidazol-4-ylmethyl]-pipe...)
Show SMILES FC(F)(F)Cc1ccccc1COC(=O)N1CCN(Cc2cncn2Cc2ccc(cc2)C#N)CC1
Show InChI InChI=1S/C26H26F3N5O2/c27-26(28,29)13-22-3-1-2-4-23(22)18-36-25(35)33-11-9-32(10-12-33)17-24-15-31-19-34(24)16-21-7-5-20(14-30)6-8-21/h1-8,15,19H,9-13,16-18H2
Reactome pathway
n/an/a 2.5n/an/an/an/an/an/a
Merck Research Laboratories
Curated by ChEMBL
Assay Description
Inhibitor of Farnesyl protein transferase(FTPase) required to reduce radiolabel [1-3H] incorporation by 50%
Bioorg Med Chem Lett 12: 2027-30 (2002)
BindingDB Entry DOI: 10.7270/Q2TQ60VS
Geranylgeranyl transferase type I beta subunit/Protein Farnesyltransferase (PFT)
(Homo sapiens (Human))
BDBM50115928
(4-[3-(4-Cyano-benzyl)-3H-imidazol-4-ylmethyl]-pipe...)
Show SMILES FC(F)(F)Cc1ccccc1COC(=O)N1CCN(Cc2cncn2Cc2ccc(cc2)C#N)CC1
Show InChI InChI=1S/C26H26F3N5O2/c27-26(28,29)13-22-3-1-2-4-23(22)18-36-25(35)33-11-9-32(10-12-33)17-24-15-31-19-34(24)16-21-7-5-20(14-30)6-8-21/h1-8,15,19H,9-13,16-18H2
n/an/an/an/a 50n/an/an/an/a
Merck Research Laboratories
Curated by ChEMBL
Assay Description
Inhibition of [1-3H]-GGPP incorporation into biotinylated K4B-Ras peptide by geranylgeranyl transferase in the presence of 5 mM ATP
Bioorg Med Chem Lett 12: 2027-30 (2002)
BindingDB Entry DOI: 10.7270/Q2TQ60VS
Geranylgeranyl transferase type I beta subunit/Protein Farnesyltransferase (PFT)
(Homo sapiens (Human))
BDBM50115928
(4-[3-(4-Cyano-benzyl)-3H-imidazol-4-ylmethyl]-pipe...)
Show SMILES FC(F)(F)Cc1ccccc1COC(=O)N1CCN(Cc2cncn2Cc2ccc(cc2)C#N)CC1
Show InChI InChI=1S/C26H26F3N5O2/c27-26(28,29)13-22-3-1-2-4-23(22)18-36-25(35)33-11-9-32(10-12-33)17-24-15-31-19-34(24)16-21-7-5-20(14-30)6-8-21/h1-8,15,19H,9-13,16-18H2
n/an/a 4.80n/an/an/an/an/an/a
Merck Research Laboratories
Curated by ChEMBL
Assay Description
Inhibition of [1-3H]-GGPP incorporation into biotinylated K4B-Ras peptide by geranylgeranyl transferase in the presence of 5 mM ATP
Bioorg Med Chem Lett 12: 2027-30 (2002)
BindingDB Entry DOI: 10.7270/Q2TQ60VS
Protein Farnesyltransferase (PFT)
(Homo sapiens (Human))
BDBM50115928
(4-[3-(4-Cyano-benzyl)-3H-imidazol-4-ylmethyl]-pipe...)
Show SMILES FC(F)(F)Cc1ccccc1COC(=O)N1CCN(Cc2cncn2Cc2ccc(cc2)C#N)CC1
Show InChI InChI=1S/C26H26F3N5O2/c27-26(28,29)13-22-3-1-2-4-23(22)18-36-25(35)33-11-9-32(10-12-33)17-24-15-31-19-34(24)16-21-7-5-20(14-30)6-8-21/h1-8,15,19H,9-13,16-18H2
Reactome pathway
n/an/a 0.850n/an/an/an/an/an/a
Merck Research Laboratories
Curated by ChEMBL
Assay Description
The concentration required to displace 50% of a highly potent radiolabeled FPTase inhibitor
Bioorg Med Chem Lett 12: 2027-30 (2002)
BindingDB Entry DOI: 10.7270/Q2TQ60VS