BDBM50116033 2-(4-Fluorophenyl)-3-(pyridin-4-yl)-1H-pyrrole::4-[2-(4-Fluoro-phenyl)-1H-pyrrol-3-yl]-pyridine::CHEMBL66802
SMILES: Fc1ccc(cc1)-c1[nH]ccc1-c1ccncc1
InChI Key: InChIKey=WJDBZZUDGFGXKR-UHFFFAOYSA-N
Data: 2 IC50
Activity Spreadsheet -- Enzyme Inhibition Constant Data from BindingDB
Found 2 hits for monomerid = 50116033
Trg + Lig
Ki
nM
ΔG°
kcal/mole
IC50
nM
Kd
nM
EC50/IC50
nM
koff
s-1
kon
M-1s-1
pHTemp
°C
Mitogen-activated protein kinase 14
(Homo sapiens (Human))
BDBM50116033
(2-(4-Fluorophenyl)-3-(pyridin-4-yl)-1H-pyrrole | 4...)
Show SMILES Fc1ccc(cc1)-c1[nH]ccc1-c1ccncc1
Show InChI InChI=1S/C15H11FN2/c16-13-3-1-12(2-4-13)15-14(7-10-18-15)11-5-8-17-9-6-11/h1-10,18H
NCI pathway
Reactome pathway
n/an/a 420n/an/an/an/an/an/a
Islamic University of Gaza
Curated by ChEMBL
Assay Description
Inhibition of p38alpha MAP kinase (unknown origin)
J Med Chem 52: 2613-7 (2009)
Article DOI: 10.1021/jm801467h
BindingDB Entry DOI: 10.7270/Q21Z449S
Mitogen-activated protein kinase 14
(Mus musculus (mouse))
BDBM50116033
(2-(4-Fluorophenyl)-3-(pyridin-4-yl)-1H-pyrrole | 4...)
Show SMILES Fc1ccc(cc1)-c1[nH]ccc1-c1ccncc1
Show InChI InChI=1S/C15H11FN2/c16-13-3-1-12(2-4-13)15-14(7-10-18-15)11-5-8-17-9-6-11/h1-10,18H
Reactome pathway
n/an/a 800n/an/an/an/an/an/a
Novartis Pharma AG
Curated by ChEMBL
Assay Description
In vivo inhibition of murine Mitogen-activated protein kinase p38 alpha activity, GST-ATF-2 as substrate in the presence of 120 microM ATP
Bioorg Med Chem Lett 12: 2109-12 (2002)
BindingDB Entry DOI: 10.7270/Q2610ZNX