BDBM50116291 (S)-3-(2',6'-Dimethoxy-biphenyl-4-yl)-2-[((S)-1-pyrazin-2-yl-pyrrolidine-2-carbonyl)-amino]-propionic acid::CHEMBL70107
SMILES: COc1cccc(OC)c1-c1ccc(C[C@H](NC(=O)[C@@H]2CCCN2c2cnccn2)C(O)=O)cc1
InChI Key: InChIKey=MGAGDDCVRPUJAS-PMACEKPBSA-N
Data: 2 IC50
Activity Spreadsheet -- Enzyme Inhibition Constant Data from BindingDB
Found 2 hits for monomerid = 50116291
Trg + Lig
Ki
nM
ΔG°
kcal/mole
IC50
nM
Kd
nM
EC50/IC50
nM
koff
s-1
kon
M-1s-1
pHTemp
°C
Fibronectin receptor beta/Integrin alpha-4
(Homo sapiens (Human))
BDBM50116291
((S)-3-(2',6'-Dimethoxy-biphenyl-4-yl)-2-[((S)-1-py...)
Show SMILES COc1cccc(OC)c1-c1ccc(C[C@H](NC(=O)[C@@H]2CCCN2c2cnccn2)C(O)=O)cc1
Show InChI InChI=1S/C26H28N4O5/c1-34-21-6-3-7-22(35-2)24(21)18-10-8-17(9-11-18)15-19(26(32)33)29-25(31)20-5-4-14-30(20)23-16-27-12-13-28-23/h3,6-13,16,19-20H,4-5,14-15H2,1-2H3,(H,29,31)(H,32,33)/t19-,20-/m0/s1
Reactome pathway
n/an/a 0.170n/an/an/an/an/an/a
Merck Research Laboratories
Curated by ChEMBL
Assay Description
Inhibition of [125I]VCAM-Ig binding to human integrin alpha4-beta1 (VLA-4) of Jurkat cells
Bioorg Med Chem Lett 12: 2205-8 (2002)
BindingDB Entry DOI: 10.7270/Q2N29W8Z
Integrin α4β7
(Homo sapiens (Human))
BDBM50116291
((S)-3-(2',6'-Dimethoxy-biphenyl-4-yl)-2-[((S)-1-py...)
Show SMILES COc1cccc(OC)c1-c1ccc(C[C@H](NC(=O)[C@@H]2CCCN2c2cnccn2)C(O)=O)cc1
Show InChI InChI=1S/C26H28N4O5/c1-34-21-6-3-7-22(35-2)24(21)18-10-8-17(9-11-18)15-19(26(32)33)29-25(31)20-5-4-14-30(20)23-16-27-12-13-28-23/h3,6-13,16,19-20H,4-5,14-15H2,1-2H3,(H,29,31)(H,32,33)/t19-,20-/m0/s1
NCI pathway
Reactome pathway
n/an/a 8.90n/an/an/an/an/an/a
Merck Research Laboratories
Curated by ChEMBL
Assay Description
Inhibition of [125I]MAdCAM-Ig binding to human integrin alpha4-beta7 of RPMI-8866 cells
Bioorg Med Chem Lett 12: 2205-8 (2002)
BindingDB Entry DOI: 10.7270/Q2N29W8Z