null
SMILES: CS(=O)(=O)n1c2ccccc2c2cc(NC(=O)CCc3ccncc3)ccc12
InChI Key: InChIKey=IXOGWBZUTOHTBT-UHFFFAOYSA-N
Activity Spreadsheet -- Enzyme Inhibition Constant Data from BindingDB
Found 1 hit for monomerid = 50116590
Trg + Lig
Ki
nM
ΔG°
kcal/mole
IC50
nM
Kd
nM
EC50/IC50
nM
koff
s-1
kon
M-1s-1
pHTemp
°C
Neuropeptide Y receptor type 5
(Homo sapiens (Human))
BDBM50116590
(CHEMBL325486 | N-(9-Methanesulfonyl-9H-carbazol-3-...)
Show SMILES CS(=O)(=O)n1c2ccccc2c2cc(NC(=O)CCc3ccncc3)ccc12
Show InChI InChI=1S/C21H19N3O3S/c1-28(26,27)24-19-5-3-2-4-17(19)18-14-16(7-8-20(18)24)23-21(25)9-6-15-10-12-22-13-11-15/h2-5,7-8,10-14H,6,9H2,1H3,(H,23,25)
n/an/a 1n/an/an/an/an/an/a
AstraZeneca
Curated by ChEMBL
Assay Description
Binding affinity to the human Neuropeptide Y receptor Y5 (NPY5)
J Med Chem 45: 3509-23 (2002)
BindingDB Entry DOI: 10.7270/Q27S7N3K