BDBM50116778 CHEMBL3608800
SMILES: COc1ccc2[nH]nc(Nc3cccc(Cl)c3)c2c1
InChI Key: InChIKey=KDHDBHGICNAFKA-UHFFFAOYSA-N
Data: 1 IC50
Activity Spreadsheet -- Enzyme Inhibition Constant Data from BindingDB
Found 1 hit for monomerid = 50116778
Trg + Lig
Ki
nM
ΔG°
kcal/mole
IC50
nM
Kd
nM
EC50/IC50
nM
koff
s-1
kon
M-1s-1
pHTemp
°C
Fatty acid desaturase 1
(Homo sapiens (Human))
BDBM50116778
(CHEMBL3608800)
Show SMILES COc1ccc2[nH]nc(Nc3cccc(Cl)c3)c2c1
Show InChI InChI=1S/C14H12ClN3O/c1-19-11-5-6-13-12(8-11)14(18-17-13)16-10-4-2-3-9(15)7-10/h2-8H,1H3,(H2,16,17,18)
Reactome pathway
n/an/a 8n/an/an/an/an/an/a
Lexicon Pharmaceuticals
Curated by ChEMBL
Assay Description
Inhibition of liver delta-5 desaturase (unknown origin)
Bioorg Med Chem Lett 25: 3836-9 (2015)
BindingDB Entry DOI: 10.7270/Q2MP552Z