BDBM50116800 CHEMBL3612809
SMILES: COc1cc(ncc1C#N)[C@H](O)CN1CCN(C[C@H](O)c2ccc3C(=O)OCc3c2C)CC1
InChI Key: InChIKey=QZUKGDYPSXQBSQ-FCHUYYIVSA-N
Data: 2 IC50
Activity Spreadsheet -- Enzyme Inhibition Constant Data from BindingDB
Found 2 hits for monomerid = 50116800
Trg + Lig
Ki
nM
ΔG°
kcal/mole
IC50
nM
Kd
nM
EC50/IC50
nM
koff
s-1
kon
M-1s-1
pHTemp
°C
ATP-sensitive inward rectifier potassium channel 1
(Homo sapiens (Human))
BDBM50116800
(CHEMBL3612809)
Show SMILES COc1cc(ncc1C#N)[C@H](O)CN1CCN(C[C@H](O)c2ccc3C(=O)OCc3c2C)CC1 |r|
Show InChI InChI=1S/C24H28N4O5/c1-15-17(3-4-18-19(15)14-33-24(18)31)21(29)12-27-5-7-28(8-6-27)13-22(30)20-9-23(32-2)16(10-25)11-26-20/h3-4,9,11,21-22,29-30H,5-8,12-14H2,1-2H3/t21-,22+/m0/s1
Reactome pathway
n/an/a 67n/an/an/an/an/an/a
Merck Research Laboratories
Curated by ChEMBL
Assay Description
Inhibition of ROMK (unknown origin) expressed in HEK293 cells by thallium flux assay
ACS Med Chem Lett 6: 747-52 (2015)
BindingDB Entry DOI: 10.7270/Q27H1MCQ
Potassium voltage-gated channel subfamily H member 2
(Homo sapiens (Human))
BDBM50116800
(CHEMBL3612809)
Show SMILES COc1cc(ncc1C#N)[C@H](O)CN1CCN(C[C@H](O)c2ccc3C(=O)OCc3c2C)CC1 |r|
Show InChI InChI=1S/C24H28N4O5/c1-15-17(3-4-18-19(15)14-33-24(18)31)21(29)12-27-5-7-28(8-6-27)13-22(30)20-9-23(32-2)16(10-25)11-26-20/h3-4,9,11,21-22,29-30H,5-8,12-14H2,1-2H3/t21-,22+/m0/s1
Reactome pathway
n/an/a 1.80E+4n/an/an/an/an/an/a
Merck Research Laboratories
Curated by ChEMBL
Assay Description
Displacement of [35S]-MK499 from human ERG expressed in HEK293 cells
ACS Med Chem Lett 6: 747-52 (2015)
BindingDB Entry DOI: 10.7270/Q27H1MCQ