BDBM50117189 CHEMBL3613340
SMILES: OC(=O)C12CC3CC(C1)C(Oc1ccc(cc1)C(=O)NCCNC(=O)c1ccc(cc1)-c1ccccc1)C(C3)C2
InChI Key: InChIKey=WLGUPSVJWVWDIP-UHFFFAOYSA-N
Data: 2 IC50
Activity Spreadsheet -- Enzyme Inhibition Constant Data from BindingDB
Found 2 hits for monomerid = 50117189
Trg + Lig
Ki
nM
ΔG°
kcal/mole
IC50
nM
Kd
nM
EC50/IC50
nM
koff
s-1
kon
M-1s-1
pHTemp
°C
Diacylglycerol O-acyltransferase 1 (DGAT1)
(Homo sapiens (Human))
BDBM50117189
(CHEMBL3613340)
Show SMILES OC(=O)C12CC3CC(C1)C(Oc1ccc(cc1)C(=O)NCCNC(=O)c1ccc(cc1)-c1ccccc1)C(C3)C2 |TLB:6:5:39:8.7.9,6:7:4.5.38:39,THB:9:7:4:38.37.39,9:37:4:8.6.7,10:9:4.5.38:39,(3.79,.17,;3.07,1.17,;3.58,2.29,;1.56,1.02,;1.56,2.59,;.12,3.07,;-1.2,2.69,;-1.2,1.02,;.34,.44,;-2.19,-.22,;-3.39,-1.16,;-3.17,-2.69,;-4.38,-3.64,;-4.16,-5.17,;-2.73,-5.74,;-1.52,-4.78,;-1.74,-3.26,;-2.5,-7.26,;-3.47,-8.03,;-1.07,-7.83,;-.85,-9.36,;.59,-9.92,;.81,-11.45,;2.24,-12.02,;3.21,-11.25,;2.47,-13.54,;3.9,-14.11,;4.12,-15.64,;2.91,-16.59,;1.48,-16.02,;1.26,-14.5,;3.13,-18.12,;4.56,-18.69,;4.78,-20.21,;3.57,-21.16,;2.14,-20.59,;1.92,-19.07,;-.95,.32,;-1,2.05,;.56,-.22,)|
Show InChI InChI=1S/C33H34N2O5/c36-30(24-8-6-23(7-9-24)22-4-2-1-3-5-22)34-14-15-35-31(37)25-10-12-28(13-11-25)40-29-26-16-21-17-27(29)20-33(18-21,19-26)32(38)39/h1-13,21,26-27,29H,14-20H2,(H,34,36)(H,35,37)(H,38,39)
n/an/a 12n/an/an/an/an/an/a
Korea Research Institute of Chemical Technology
Curated by ChEMBL
Assay Description
Inhibition of human DGAT1 expressed in human Hep3B cells incubated for 60 mins using didecanoyl glycerol and [14C]decanoyl-CoA substrate by liquid sc...
Eur J Med Chem 101: 716-35 (2015)
BindingDB Entry DOI: 10.7270/Q2B859WR
Diacylglycerol O-acyltransferase 1
(Mus musculus (mouse))
BDBM50117189
(CHEMBL3613340)
Show SMILES OC(=O)C12CC3CC(C1)C(Oc1ccc(cc1)C(=O)NCCNC(=O)c1ccc(cc1)-c1ccccc1)C(C3)C2 |TLB:6:5:39:8.7.9,6:7:4.5.38:39,THB:9:7:4:38.37.39,9:37:4:8.6.7,10:9:4.5.38:39,(3.79,.17,;3.07,1.17,;3.58,2.29,;1.56,1.02,;1.56,2.59,;.12,3.07,;-1.2,2.69,;-1.2,1.02,;.34,.44,;-2.19,-.22,;-3.39,-1.16,;-3.17,-2.69,;-4.38,-3.64,;-4.16,-5.17,;-2.73,-5.74,;-1.52,-4.78,;-1.74,-3.26,;-2.5,-7.26,;-3.47,-8.03,;-1.07,-7.83,;-.85,-9.36,;.59,-9.92,;.81,-11.45,;2.24,-12.02,;3.21,-11.25,;2.47,-13.54,;3.9,-14.11,;4.12,-15.64,;2.91,-16.59,;1.48,-16.02,;1.26,-14.5,;3.13,-18.12,;4.56,-18.69,;4.78,-20.21,;3.57,-21.16,;2.14,-20.59,;1.92,-19.07,;-.95,.32,;-1,2.05,;.56,-.22,)|
Show InChI InChI=1S/C33H34N2O5/c36-30(24-8-6-23(7-9-24)22-4-2-1-3-5-22)34-14-15-35-31(37)25-10-12-28(13-11-25)40-29-26-16-21-17-27(29)20-33(18-21,19-26)32(38)39/h1-13,21,26-27,29H,14-20H2,(H,34,36)(H,35,37)(H,38,39)
Reactome pathway
n/an/a 8n/an/an/an/an/an/a
Korea Research Institute of Chemical Technology
Curated by ChEMBL
Assay Description
Inhibition of mouse DGAT1 incubated for 60 mins using didecanoyl glycerol and [14C]decanoyl-CoA substrate by liquid scintillation counting and lumino...
Eur J Med Chem 101: 716-35 (2015)
BindingDB Entry DOI: 10.7270/Q2B859WR