BDBM50117304 4-[6,7-Bis-(2-methoxy-ethoxy)-quinazolin-4-yl]-piperazine-1-carboxylic acid (4-isopropoxy-phenyl)-amide::CHEMBL125451
SMILES: COCCOc1cc2ncnc(N3CCN(CC3)C(=O)Nc3ccc(OC(C)C)cc3)c2cc1OCCOC
InChI Key: InChIKey=XLPRFHHHAVYDKP-UHFFFAOYSA-N
Data: 2 IC50
Activity Spreadsheet -- Enzyme Inhibition Constant Data from BindingDB
Found 2 hits for monomerid = 50117304
Trg + Lig
Ki
nM
ΔG°
kcal/mole
IC50
nM
Kd
nM
EC50/IC50
nM
koff
s-1
kon
M-1s-1
pHTemp
°C
Platelet-derived growth factor receptor beta
(Homo sapiens (Human))
BDBM50117304
(4-[6,7-Bis-(2-methoxy-ethoxy)-quinazolin-4-yl]-pip...)
Show SMILES COCCOc1cc2ncnc(N3CCN(CC3)C(=O)Nc3ccc(OC(C)C)cc3)c2cc1OCCOC
Show InChI InChI=1S/C28H37N5O6/c1-20(2)39-22-7-5-21(6-8-22)31-28(34)33-11-9-32(10-12-33)27-23-17-25(37-15-13-35-3)26(38-16-14-36-4)18-24(23)29-19-30-27/h5-8,17-20H,9-16H2,1-4H3,(H,31,34)
NCI pathway
Reactome pathway
n/an/a 50n/an/an/an/an/an/a
Millennium Pharmaceuticals, Inc.
Curated by ChEMBL
Assay Description
Inhibition of platelet-derived growth factor receptor beta phosphorylation in MG63 cells in the absence of plasma
J Med Chem 45: 3772-93 (2002)
BindingDB Entry DOI: 10.7270/Q2WW7JD9
Platelet-derived growth factor receptor beta
(Homo sapiens (Human))
BDBM50117304
(4-[6,7-Bis-(2-methoxy-ethoxy)-quinazolin-4-yl]-pip...)
Show SMILES COCCOc1cc2ncnc(N3CCN(CC3)C(=O)Nc3ccc(OC(C)C)cc3)c2cc1OCCOC
Show InChI InChI=1S/C28H37N5O6/c1-20(2)39-22-7-5-21(6-8-22)31-28(34)33-11-9-32(10-12-33)27-23-17-25(37-15-13-35-3)26(38-16-14-36-4)18-24(23)29-19-30-27/h5-8,17-20H,9-16H2,1-4H3,(H,31,34)
NCI pathway
Reactome pathway
n/an/a 300n/an/an/an/an/an/a
Millennium Pharmaceuticals, Inc.
Curated by ChEMBL
Assay Description
Inhibition of platelet derived growth factor receptor beta phosphorylation in MG63 cells in the presence of human plasma
J Med Chem 45: 3772-93 (2002)
BindingDB Entry DOI: 10.7270/Q2WW7JD9