BDBM50117488 CHEMBL217362::H-His-Ala-Lys-Arg-Arg-Leu-Ile-Phe-NH2
SMILES: CC[C@H](C)[C@H](NC(=O)[C@H](CC(C)C)NC(=O)[C@H](CCCNC(N)=N)NC(=O)[C@H](CCCNC(N)=N)NC(=O)[C@H](CCCCN)NC(=O)[C@H](C)NC(=O)[C@@H](N)Cc1cnc[nH]1)C(=O)N[C@@H](Cc1ccccc1)C(N)=O
InChI Key: InChIKey=YHVVVHLDNQXTEZ-GXTUSLNOSA-N
Data: 3 IC50
Activity Spreadsheet -- Enzyme Inhibition Constant Data from BindingDB
Found 3 hits for monomerid = 50117488
Trg + Lig
Ki
nM
ΔG°
kcal/mole
IC50
nM
Kd
nM
EC50/IC50
nM
koff
s-1
kon
M-1s-1
pHTemp
°C
CDK2/Cyclin A/Cyclin A1
(Homo sapiens (Human))
BDBM50117488
(CHEMBL217362 | H-His-Ala-Lys-Arg-Arg-Leu-Ile-Phe-N...)
Show SMILES CC[C@H](C)[C@H](NC(=O)[C@H](CC(C)C)NC(=O)[C@H](CCCNC(N)=N)NC(=O)[C@H](CCCNC(N)=N)NC(=O)[C@H](CCCCN)NC(=O)[C@H](C)NC(=O)[C@@H](N)Cc1cnc[nH]1)C(=O)N[C@@H](Cc1ccccc1)C(N)=O
Show InChI InChI=1S/C48H82N18O8/c1-6-28(4)38(46(74)64-36(39(51)67)23-30-14-8-7-9-15-30)66-45(73)37(22-27(2)3)65-44(72)35(18-13-21-58-48(54)55)63-43(71)34(17-12-20-57-47(52)53)62-42(70)33(16-10-11-19-49)61-40(68)29(5)60-41(69)32(50)24-31-25-56-26-59-31/h7-9,14-15,25-29,32-38H,6,10-13,16-24,49-50H2,1-5H3,(H2,51,67)(H,56,59)(H,60,69)(H,61,68)(H,62,70)(H,63,71)(H,64,74)(H,65,72)(H,66,73)(H4,52,53,57)(H4,54,55,58)/t28-,29-,32-,33-,34-,35-,36-,37-,38-/m0/s1
Reactome pathway
n/an/a 140n/an/an/an/an/an/a
Georgetown University
Curated by ChEMBL
Assay Description
Inhibition of CDK2/cyclin A
AAPS J 8: 204-21 (2006)
Article DOI: 10.1208/aapsj080125
BindingDB Entry DOI: 10.7270/Q2TX3GBS
Cyclin-A2
(Homo sapiens (Human))
BDBM50117488
(CHEMBL217362 | H-His-Ala-Lys-Arg-Arg-Leu-Ile-Phe-N...)
Show SMILES CC[C@H](C)[C@H](NC(=O)[C@H](CC(C)C)NC(=O)[C@H](CCCNC(N)=N)NC(=O)[C@H](CCCNC(N)=N)NC(=O)[C@H](CCCCN)NC(=O)[C@H](C)NC(=O)[C@@H](N)Cc1cnc[nH]1)C(=O)N[C@@H](Cc1ccccc1)C(N)=O
Show InChI InChI=1S/C48H82N18O8/c1-6-28(4)38(46(74)64-36(39(51)67)23-30-14-8-7-9-15-30)66-45(73)37(22-27(2)3)65-44(72)35(18-13-21-58-48(54)55)63-43(71)34(17-12-20-57-47(52)53)62-42(70)33(16-10-11-19-49)61-40(68)29(5)60-41(69)32(50)24-31-25-56-26-59-31/h7-9,14-15,25-29,32-38H,6,10-13,16-24,49-50H2,1-5H3,(H2,51,67)(H,56,59)(H,60,69)(H,61,68)(H,62,70)(H,63,71)(H,64,74)(H,65,72)(H,66,73)(H4,52,53,57)(H4,54,55,58)/t28-,29-,32-,33-,34-,35-,36-,37-,38-/m0/s1
NCI pathway
Reactome pathway
n/an/a 50n/an/an/an/an/an/a
Georgetown University
Curated by ChEMBL
Assay Description
Binding affinity to Cyclin A by competitive binding assay
AAPS J 8: 204-21 (2006)
Article DOI: 10.1208/aapsj080125
BindingDB Entry DOI: 10.7270/Q2TX3GBS
CDK2/Cyclin A/Cyclin A1
(Homo sapiens (Human))
BDBM50117488
(CHEMBL217362 | H-His-Ala-Lys-Arg-Arg-Leu-Ile-Phe-N...)
Show SMILES CC[C@H](C)[C@H](NC(=O)[C@H](CC(C)C)NC(=O)[C@H](CCCNC(N)=N)NC(=O)[C@H](CCCNC(N)=N)NC(=O)[C@H](CCCCN)NC(=O)[C@H](C)NC(=O)[C@@H](N)Cc1cnc[nH]1)C(=O)N[C@@H](Cc1ccccc1)C(N)=O
Show InChI InChI=1S/C48H82N18O8/c1-6-28(4)38(46(74)64-36(39(51)67)23-30-14-8-7-9-15-30)66-45(73)37(22-27(2)3)65-44(72)35(18-13-21-58-48(54)55)63-43(71)34(17-12-20-57-47(52)53)62-42(70)33(16-10-11-19-49)61-40(68)29(5)60-41(69)32(50)24-31-25-56-26-59-31/h7-9,14-15,25-29,32-38H,6,10-13,16-24,49-50H2,1-5H3,(H2,51,67)(H,56,59)(H,60,69)(H,61,68)(H,62,70)(H,63,71)(H,64,74)(H,65,72)(H,66,73)(H4,52,53,57)(H4,54,55,58)/t28-,29-,32-,33-,34-,35-,36-,37-,38-/m0/s1
Reactome pathway
n/an/a 39n/an/an/an/an/an/a
University of Nottingham
Curated by ChEMBL
Assay Description
In vitro inhibition of CDK2-cyclin A kinase activity on retinoblastoma protein
Bioorg Med Chem Lett 12: 2501-5 (2002)
BindingDB Entry DOI: 10.7270/Q2CC101N