BDBM50117605 4-[3-(5,6-Dimethoxy-benzo[b]thiophen-2-yl)-3-oxo-propyl]-1-ethyl-pyridinium; bromide::CHEMBL87128
SMILES: CC[n+]1ccc(CCC(=O)c2cc3cc(OC)c(OC)cc3s2)cc1
InChI Key: InChIKey=RESFYLPQQBQWLK-UHFFFAOYSA-N
Data: 1 IC50  1 EC50
Activity Spreadsheet -- Enzyme Inhibition Constant Data from BindingDB
Found 2 hits for monomerid = 50117605
Trg + Lig
Ki
nM
ΔG°
kcal/mole
IC50
nM
Kd
nM
EC50/IC50
nM
koff
s-1
kon
M-1s-1
pHTemp
°C
Acetylcholinesterase
(Homo sapiens (Human))
BDBM50117605
(4-[3-(5,6-Dimethoxy-benzo[b]thiophen-2-yl)-3-oxo-p...)
Show SMILES CC[n+]1ccc(CCC(=O)c2cc3cc(OC)c(OC)cc3s2)cc1
Show InChI InChI=1S/C20H22NO3S/c1-4-21-9-7-14(8-10-21)5-6-16(22)20-12-15-11-17(23-2)18(24-3)13-19(15)25-20/h7-13H,4-6H2,1-3H3/q+1
NCI pathway
Reactome pathway
n/an/an/an/a>3.00E+3n/an/an/an/a
Organon Laboratories Ltd.
Curated by ChEMBL
Assay Description
In vitro reversal of vecuronium-induced block in isolated guinea pig hemi-diaphragm.
Bioorg Med Chem Lett 12: 2569-72 (2002)
BindingDB Entry DOI: 10.7270/Q28916C0
Acetylcholinesterase
(Homo sapiens (Human))
BDBM50117605
(4-[3-(5,6-Dimethoxy-benzo[b]thiophen-2-yl)-3-oxo-p...)
Show SMILES CC[n+]1ccc(CCC(=O)c2cc3cc(OC)c(OC)cc3s2)cc1
Show InChI InChI=1S/C20H22NO3S/c1-4-21-9-7-14(8-10-21)5-6-16(22)20-12-15-11-17(23-2)18(24-3)13-19(15)25-20/h7-13H,4-6H2,1-3H3/q+1
NCI pathway
Reactome pathway
n/an/a 280n/an/an/an/an/an/a
Organon Laboratories Ltd.
Curated by ChEMBL
Assay Description
Concentration required for the inhibition of acetylcholinesterase
Bioorg Med Chem Lett 12: 2569-72 (2002)
BindingDB Entry DOI: 10.7270/Q28916C0