BDBM50117621 1-Benzyl-4-(5,6-dimethoxy-benzo[b]thiophen-2-ylmethyl)-1-methyl-piperidinium; bromide::CHEMBL86233
SMILES: COc1cc2cc(CC3CC[N+](C)(Cc4ccccc4)CC3)sc2cc1OC
InChI Key: InChIKey=PCQMYUIQDLAOSQ-UHFFFAOYSA-N
Data: 1 IC50  1 EC50
Activity Spreadsheet -- Enzyme Inhibition Constant Data from BindingDB
Found 2 hits for monomerid = 50117621
Trg + Lig
Ki
nM
ΔG°
kcal/mole
IC50
nM
Kd
nM
EC50/IC50
nM
koff
s-1
kon
M-1s-1
pHTemp
°C
Acetylcholinesterase
(Homo sapiens (Human))
BDBM50117621
(1-Benzyl-4-(5,6-dimethoxy-benzo[b]thiophen-2-ylmet...)
Show SMILES COc1cc2cc(CC3CC[N+](C)(Cc4ccccc4)CC3)sc2cc1OC |(3.16,-1.52,;4.48,-.75,;5.81,-1.52,;7.12,-.75,;8.45,-1.52,;9.94,-1.03,;10.85,-2.29,;12.39,-2.29,;13.14,-.96,;14.68,-.79,;15.29,.62,;14.38,1.86,;13.17,2.82,;14.99,3.26,;16.53,3.43,;17.13,4.85,;18.65,5.02,;19.58,3.78,;18.97,2.37,;17.44,2.19,;12.84,1.68,;12.23,.27,;9.94,-3.55,;8.45,-3.06,;7.14,-3.83,;5.81,-3.06,;4.48,-3.83,;3.16,-3.06,)|
Show InChI InChI=1S/C24H30NO2S/c1-25(17-19-7-5-4-6-8-19)11-9-18(10-12-25)13-21-14-20-15-22(26-2)23(27-3)16-24(20)28-21/h4-8,14-16,18H,9-13,17H2,1-3H3/q+1
NCI pathway
Reactome pathway
n/an/an/an/a>3.00E+4n/an/an/an/a
Organon Laboratories Ltd.
Curated by ChEMBL
Assay Description
Concentration required for the inhibition of acetylcholinesterase
Bioorg Med Chem Lett 12: 2569-72 (2002)
BindingDB Entry DOI: 10.7270/Q28916C0
Acetylcholinesterase
(Homo sapiens (Human))
BDBM50117621
(1-Benzyl-4-(5,6-dimethoxy-benzo[b]thiophen-2-ylmet...)
Show SMILES COc1cc2cc(CC3CC[N+](C)(Cc4ccccc4)CC3)sc2cc1OC |(3.16,-1.52,;4.48,-.75,;5.81,-1.52,;7.12,-.75,;8.45,-1.52,;9.94,-1.03,;10.85,-2.29,;12.39,-2.29,;13.14,-.96,;14.68,-.79,;15.29,.62,;14.38,1.86,;13.17,2.82,;14.99,3.26,;16.53,3.43,;17.13,4.85,;18.65,5.02,;19.58,3.78,;18.97,2.37,;17.44,2.19,;12.84,1.68,;12.23,.27,;9.94,-3.55,;8.45,-3.06,;7.14,-3.83,;5.81,-3.06,;4.48,-3.83,;3.16,-3.06,)|
Show InChI InChI=1S/C24H30NO2S/c1-25(17-19-7-5-4-6-8-19)11-9-18(10-12-25)13-21-14-20-15-22(26-2)23(27-3)16-24(20)28-21/h4-8,14-16,18H,9-13,17H2,1-3H3/q+1
NCI pathway
Reactome pathway
n/an/a 1.00E+4n/an/an/an/an/an/a
Organon Laboratories Ltd.
Curated by ChEMBL
Assay Description
Concentration required for the inhibition of acetylcholinesterase
Bioorg Med Chem Lett 12: 2569-72 (2002)
BindingDB Entry DOI: 10.7270/Q28916C0