BDBM50117908 CHEMBL3612609
SMILES: CCNC(=S)NCC1CCc2ccccc2N1C
InChI Key: InChIKey=XZWXQCVCORKBBZ-UHFFFAOYSA-N
Data: 1 KI  1 EC50
Activity Spreadsheet -- Enzyme Inhibition Constant Data from BindingDB
Found 2 hits for monomerid = 50117908
Trg + Lig
Ki
nM
ΔG°
kcal/mole
IC50
nM
Kd
nM
EC50/IC50
nM
koff
s-1
kon
M-1s-1
pHTemp
°C
Melatonin receptor
(Homo sapiens (Human))
BDBM50117908
(CHEMBL3612609)
Show SMILES CCNC(=S)NCC1CCc2ccccc2N1C
Show InChI InChI=1S/C14H21N3S/c1-3-15-14(18)16-10-12-9-8-11-6-4-5-7-13(11)17(12)2/h4-7,12H,3,8-10H2,1-2H3,(H2,15,16,18)
Reactome pathway
22n/an/an/an/an/an/an/an/a
Universit£ degli Studi di Urbino"Carlo Bo"
Curated by ChEMBL
Assay Description
Displacement of 2-[125I]-Iodomelatonin from human MT1 receptor transfected in CHO cell membranes after 120 mins
J Med Chem 58: 7512-25 (2015)
BindingDB Entry DOI: 10.7270/Q20R9R6D
Melatonin receptor
(Homo sapiens (Human))
BDBM50117908
(CHEMBL3612609)
Show SMILES CCNC(=S)NCC1CCc2ccccc2N1C
Show InChI InChI=1S/C14H21N3S/c1-3-15-14(18)16-10-12-9-8-11-6-4-5-7-13(11)17(12)2/h4-7,12H,3,8-10H2,1-2H3,(H2,15,16,18)
Reactome pathway
n/an/an/an/a 809n/an/an/an/a
Universit£ degli Studi di Urbino"Carlo Bo"
Curated by ChEMBL
Assay Description
Intrinsic activity at human MT1 receptor transfected in CHO cell membranes after 1 hr by [35S]GTPgammaS binding assay
J Med Chem 58: 7512-25 (2015)
BindingDB Entry DOI: 10.7270/Q20R9R6D