BDBM50118260 9-(4-Hydroxy-phenyl)-1,2,3,9-tetrahydro-4,9a-diaza-fluoren-9-ol::CHEMBL130668
SMILES: Oc1ccc(cc1)C1(O)N2CCCN=C2c2ccccc12
InChI Key: InChIKey=NFNRNOMETYDQMI-UHFFFAOYSA-N
Data: 3 KI  5 IC50
Activity Spreadsheet -- Enzyme Inhibition Constant Data from BindingDB
Found 8 hits for monomerid = 50118260
Trg + Lig
Ki
nM
ΔG°
kcal/mole
IC50
nM
Kd
nM
EC50/IC50
nM
koff
s-1
kon
M-1s-1
pHTemp
°C
Sodium-dependent serotonin transporter
(Homo sapiens (Human))
BDBM50118260
(9-(4-Hydroxy-phenyl)-1,2,3,9-tetrahydro-4,9a-diaza...)
Show SMILES Oc1ccc(cc1)C1(O)N2CCCN=C2c2ccccc12 |c:14|
Show InChI InChI=1S/C17H16N2O2/c20-13-8-6-12(7-9-13)17(21)15-5-2-1-4-14(15)16-18-10-3-11-19(16)17/h1-2,4-9,20-21H,3,10-11H2
77n/an/an/an/an/an/an/an/a
Drew University
Curated by ChEMBL
Assay Description
Displacement of [125I]- RTI-55 from Serotonin transporter expressed in HEK cells
J Med Chem 45: 4097-109 (2002)
BindingDB Entry DOI: 10.7270/Q2MC90R8
Sodium-dependent dopamine transporter
(Homo sapiens (Human))
BDBM50118260
(9-(4-Hydroxy-phenyl)-1,2,3,9-tetrahydro-4,9a-diaza...)
Show SMILES Oc1ccc(cc1)C1(O)N2CCCN=C2c2ccccc12 |c:14|
Show InChI InChI=1S/C17H16N2O2/c20-13-8-6-12(7-9-13)17(21)15-5-2-1-4-14(15)16-18-10-3-11-19(16)17/h1-2,4-9,20-21H,3,10-11H2
NCI pathway
Reactome pathway
87.1n/an/an/an/an/an/an/an/a
Drew University
Curated by ChEMBL
Assay Description
Displacement of [125I]- RTI-55 from Dopamine transporter expressed in HEK cells
J Med Chem 45: 4097-109 (2002)
BindingDB Entry DOI: 10.7270/Q2MC90R8
Sodium-dependent noradrenaline transporter
(Homo sapiens (Human))
BDBM50118260
(9-(4-Hydroxy-phenyl)-1,2,3,9-tetrahydro-4,9a-diaza...)
Show SMILES Oc1ccc(cc1)C1(O)N2CCCN=C2c2ccccc12 |c:14|
Show InChI InChI=1S/C17H16N2O2/c20-13-8-6-12(7-9-13)17(21)15-5-2-1-4-14(15)16-18-10-3-11-19(16)17/h1-2,4-9,20-21H,3,10-11H2
Reactome pathway
380n/an/an/an/an/an/an/an/a
Drew University
Curated by ChEMBL
Assay Description
Displacement of [125I]RTI-55 from human Norepinephrine transporter expressed in HEK cells
J Med Chem 45: 4097-109 (2002)
BindingDB Entry DOI: 10.7270/Q2MC90R8
Sodium-dependent noradrenaline transporter
(Homo sapiens (Human))
BDBM50118260
(9-(4-Hydroxy-phenyl)-1,2,3,9-tetrahydro-4,9a-diaza...)
Show SMILES Oc1ccc(cc1)C1(O)N2CCCN=C2c2ccccc12 |c:14|
Show InChI InChI=1S/C17H16N2O2/c20-13-8-6-12(7-9-13)17(21)15-5-2-1-4-14(15)16-18-10-3-11-19(16)17/h1-2,4-9,20-21H,3,10-11H2
Reactome pathway
n/an/a 1.90n/an/an/an/an/an/a
Drew University
Curated by ChEMBL
Assay Description
Inhibition of NE uptake in HEK cells expressing human noradrenaline transporter (hNET)
J Med Chem 45: 4097-109 (2002)
BindingDB Entry DOI: 10.7270/Q2MC90R8
Sodium-dependent serotonin transporter
(Homo sapiens (Human))
BDBM50118260
(9-(4-Hydroxy-phenyl)-1,2,3,9-tetrahydro-4,9a-diaza...)
Show SMILES Oc1ccc(cc1)C1(O)N2CCCN=C2c2ccccc12 |c:14|
Show InChI InChI=1S/C17H16N2O2/c20-13-8-6-12(7-9-13)17(21)15-5-2-1-4-14(15)16-18-10-3-11-19(16)17/h1-2,4-9,20-21H,3,10-11H2
n/an/a 60n/an/an/an/an/an/a
Drew University
Curated by ChEMBL
Assay Description
Inhibition of 5-HT uptake in HEK cells expressing human serotonin transporter (hSERT)
J Med Chem 45: 4097-109 (2002)
BindingDB Entry DOI: 10.7270/Q2MC90R8
Sodium-dependent dopamine transporter
(Rattus norvegicus (rat))
BDBM50118260
(9-(4-Hydroxy-phenyl)-1,2,3,9-tetrahydro-4,9a-diaza...)
Show SMILES Oc1ccc(cc1)C1(O)N2CCCN=C2c2ccccc12 |c:14|
Show InChI InChI=1S/C17H16N2O2/c20-13-8-6-12(7-9-13)17(21)15-5-2-1-4-14(15)16-18-10-3-11-19(16)17/h1-2,4-9,20-21H,3,10-11H2
Reactome pathway
n/an/a 3.40n/an/an/an/an/an/a
Drew University
Curated by ChEMBL
Assay Description
Ability to displace [3H]WIN-35428 from Dopamine Transporter of rat striatal membrane
J Med Chem 45: 4097-109 (2002)
BindingDB Entry DOI: 10.7270/Q2MC90R8
Sodium-dependent dopamine transporter
(Rattus norvegicus (rat))
BDBM50118260
(9-(4-Hydroxy-phenyl)-1,2,3,9-tetrahydro-4,9a-diaza...)
Show SMILES Oc1ccc(cc1)C1(O)N2CCCN=C2c2ccccc12 |c:14|
Show InChI InChI=1S/C17H16N2O2/c20-13-8-6-12(7-9-13)17(21)15-5-2-1-4-14(15)16-18-10-3-11-19(16)17/h1-2,4-9,20-21H,3,10-11H2
Reactome pathway
n/an/a 3.40n/an/an/an/an/an/a
National Institute on Drug Abuse-Intramural Research Program/NIH
Curated by ChEMBL
Assay Description
Ability to displace [3H]-WIN-35,428 from dopamine transporter in rat caudate putamen tissue
J Med Chem 45: 4119-27 (2002)
BindingDB Entry DOI: 10.7270/Q21Z43R6
Sodium-dependent dopamine transporter
(Homo sapiens (Human))
BDBM50118260
(9-(4-Hydroxy-phenyl)-1,2,3,9-tetrahydro-4,9a-diaza...)
Show SMILES Oc1ccc(cc1)C1(O)N2CCCN=C2c2ccccc12 |c:14|
Show InChI InChI=1S/C17H16N2O2/c20-13-8-6-12(7-9-13)17(21)15-5-2-1-4-14(15)16-18-10-3-11-19(16)17/h1-2,4-9,20-21H,3,10-11H2
NCI pathway
Reactome pathway
n/an/a 59n/an/an/an/an/an/a
Drew University
Curated by ChEMBL
Assay Description
Inhibition of dopamine uptake in HEK cells expressing human dopamine transporter (hDAT)
J Med Chem 45: 4097-109 (2002)
BindingDB Entry DOI: 10.7270/Q2MC90R8