BDBM50118465 CHEMBL3613187
SMILES: CNS(=O)(=O)c1cccc(Nc2ncnc3[nH]c(cc23)-c2ccc(C)cc2)c1
InChI Key: InChIKey=VFQPSAHXVPLCEP-UHFFFAOYSA-N
Data: 2 IC50
Activity Spreadsheet -- Enzyme Inhibition Constant Data from BindingDB
Found 2 hits for monomerid = 50118465
Trg + Lig
Ki
nM
ΔG°
kcal/mole
IC50
nM
Kd
nM
EC50/IC50
nM
koff
s-1
kon
M-1s-1
pHTemp
°C
Serine/threonine-protein kinase B-raf
(Homo sapiens (Human))
BDBM50118465
(CHEMBL3613187)
Show SMILES CNS(=O)(=O)c1cccc(Nc2ncnc3[nH]c(cc23)-c2ccc(C)cc2)c1
Show InChI InChI=1S/C20H19N5O2S/c1-13-6-8-14(9-7-13)18-11-17-19(22-12-23-20(17)25-18)24-15-4-3-5-16(10-15)28(26,27)21-2/h3-12,21H,1-2H3,(H2,22,23,24,25)
NCI pathway
Reactome pathway
n/an/a 1n/an/an/an/an/an/a
GlaxoSmithKline
Curated by ChEMBL
Assay Description
Inhibition of His6-tagged full length BRAF V600E mutant (2 to 766 residues) (unknown origin) expressed in Baculovirus expression system by BRAMA meth...
J Med Chem 58: 7431-48 (2015)
BindingDB Entry DOI: 10.7270/Q2FT8NV1
TNNI3K
(Homo sapiens (Human))
BDBM50118465
(CHEMBL3613187)
Show SMILES CNS(=O)(=O)c1cccc(Nc2ncnc3[nH]c(cc23)-c2ccc(C)cc2)c1
Show InChI InChI=1S/C20H19N5O2S/c1-13-6-8-14(9-7-13)18-11-17-19(22-12-23-20(17)25-18)24-15-4-3-5-16(10-15)28(26,27)21-2/h3-12,21H,1-2H3,(H2,22,23,24,25)
n/an/a 13n/an/an/an/an/an/a
GlaxoSmithKline
Curated by ChEMBL
Assay Description
Displacement of 5-({[2-({[3-({4-[(5-hydroxy-2-methylphenyl)amino]-2-pyrimidinyl}amino)phenyl]carbonyl}amino)-ethyl]amino}carbonyl)-2-(6-hydroxy-3-oxo...
J Med Chem 58: 7431-48 (2015)
BindingDB Entry DOI: 10.7270/Q2FT8NV1