BDBM50118468 CHEMBL3613190
SMILES: CNS(=O)(=O)c1cccc(Nc2ncnc3[nH]c(cc23)-c2ccncc2)c1
InChI Key: InChIKey=UKXBJWFWOIBXLA-UHFFFAOYSA-N
Data: 2 IC50
Activity Spreadsheet -- Enzyme Inhibition Constant Data from BindingDB
Found 2 hits for monomerid = 50118468
Trg + Lig
Ki
nM
ΔG°
kcal/mole
IC50
nM
Kd
nM
EC50/IC50
nM
koff
s-1
kon
M-1s-1
pHTemp
°C
Serine/threonine-protein kinase B-raf
(Homo sapiens (Human))
BDBM50118468
(CHEMBL3613190)
Show SMILES CNS(=O)(=O)c1cccc(Nc2ncnc3[nH]c(cc23)-c2ccncc2)c1
Show InChI InChI=1S/C18H16N6O2S/c1-19-27(25,26)14-4-2-3-13(9-14)23-17-15-10-16(12-5-7-20-8-6-12)24-18(15)22-11-21-17/h2-11,19H,1H3,(H2,21,22,23,24)
NCI pathway
Reactome pathway
n/an/a 1n/an/an/an/an/an/a
GlaxoSmithKline
Curated by ChEMBL
Assay Description
Inhibition of His6-tagged full length BRAF V600E mutant (2 to 766 residues) (unknown origin) expressed in Baculovirus expression system by BRAMA meth...
J Med Chem 58: 7431-48 (2015)
BindingDB Entry DOI: 10.7270/Q2FT8NV1
TNNI3K
(Homo sapiens (Human))
BDBM50118468
(CHEMBL3613190)
Show SMILES CNS(=O)(=O)c1cccc(Nc2ncnc3[nH]c(cc23)-c2ccncc2)c1
Show InChI InChI=1S/C18H16N6O2S/c1-19-27(25,26)14-4-2-3-13(9-14)23-17-15-10-16(12-5-7-20-8-6-12)24-18(15)22-11-21-17/h2-11,19H,1H3,(H2,21,22,23,24)
n/an/a 20n/an/an/an/an/an/a
GlaxoSmithKline
Curated by ChEMBL
Assay Description
Displacement of 5-({[2-({[3-({4-[(5-hydroxy-2-methylphenyl)amino]-2-pyrimidinyl}amino)phenyl]carbonyl}amino)-ethyl]amino}carbonyl)-2-(6-hydroxy-3-oxo...
J Med Chem 58: 7431-48 (2015)
BindingDB Entry DOI: 10.7270/Q2FT8NV1