BDBM50118494 5-Methyl-1-(4-trityloxy-but-2-enyl)-dihydro-pyrimidine-2,4-dione::CHEMBL134857
SMILES: CC1CN(C\C=C/COC(c2ccccc2)(c2ccccc2)c2ccccc2)C(O)=NC1=O
InChI Key: InChIKey=QUMGQQIIAAEFAK-QXMHVHEDSA-N
Data: 1 IC50
Activity Spreadsheet -- Enzyme Inhibition Constant Data from BindingDB
Found 1 hit for monomerid = 50118494
Trg + Lig
Ki
nM
ΔG°
kcal/mole
IC50
nM
Kd
nM
EC50/IC50
nM
koff
s-1
kon
M-1s-1
pHTemp
°C
Thymidine kinase, cytosolic
(Homo sapiens (Human))
BDBM50118494
(5-Methyl-1-(4-trityloxy-but-2-enyl)-dihydro-pyrimi...)
Show SMILES CC1CN(C\C=C/COC(c2ccccc2)(c2ccccc2)c2ccccc2)C(O)=NC1=O |c:32|
Show InChI InChI=1S/C28H28N2O3/c1-22-21-30(27(32)29-26(22)31)19-11-12-20-33-28(23-13-5-2-6-14-23,24-15-7-3-8-16-24)25-17-9-4-10-18-25/h2-18,22H,19-21H2,1H3,(H,29,31,32)/b12-11-
NCI pathway
Reactome pathway
n/an/a 9.80E+3n/an/an/an/an/an/a
Instituto de Qu£mica M£dica (CSIC)
Curated by ChEMBL
Assay Description
Inhibitory effect against phosphorylation of [methyl-3H]dThd by Thymidine Kinase 2 (TK-2)
J Med Chem 45: 4254-63 (2002)
BindingDB Entry DOI: 10.7270/Q2GQ6ZGB