BDBM50118501 1-(3-Hydroxy-4-trityloxy-butyl)-5-methyl-1H-pyrimidine-2,4-dione::CHEMBL341163
SMILES: Cc1cn(CCC(O)COC(c2ccccc2)(c2ccccc2)c2ccccc2)c(=O)[nH]c1=O
InChI Key: InChIKey=JKNDCDNZAVZXBO-UHFFFAOYSA-N
Data: 2 IC50
Activity Spreadsheet -- Enzyme Inhibition Constant Data from BindingDB
Found 2 hits for monomerid = 50118501
Trg + Lig
Ki
nM
ΔG°
kcal/mole
IC50
nM
Kd
nM
EC50/IC50
nM
koff
s-1
kon
M-1s-1
pHTemp
°C
Thymidine kinase, cytosolic
(Homo sapiens (Human))
BDBM50118501
(1-(3-Hydroxy-4-trityloxy-butyl)-5-methyl-1H-pyrimi...)
Show SMILES Cc1cn(CCC(O)COC(c2ccccc2)(c2ccccc2)c2ccccc2)c(=O)[nH]c1=O
Show InChI InChI=1S/C28H28N2O4/c1-21-19-30(27(33)29-26(21)32)18-17-25(31)20-34-28(22-11-5-2-6-12-22,23-13-7-3-8-14-23)24-15-9-4-10-16-24/h2-16,19,25,31H,17-18,20H2,1H3,(H,29,32,33)
NCI pathway
Reactome pathway
n/an/a 1.20E+3n/an/an/an/an/an/a
Instituto de Qu£mica M£dica (CSIC)
Curated by ChEMBL
Assay Description
Compound was evaluated for inhibitory effect against phosphorylation of [methyl-3H]dThd by HSV-1 Thymidine kinase
J Med Chem 45: 4254-63 (2002)
BindingDB Entry DOI: 10.7270/Q2GQ6ZGB
Thymidine kinase, cytosolic
(Homo sapiens (Human))
BDBM50118501
(1-(3-Hydroxy-4-trityloxy-butyl)-5-methyl-1H-pyrimi...)
Show SMILES Cc1cn(CCC(O)COC(c2ccccc2)(c2ccccc2)c2ccccc2)c(=O)[nH]c1=O
Show InChI InChI=1S/C28H28N2O4/c1-21-19-30(27(33)29-26(21)32)18-17-25(31)20-34-28(22-11-5-2-6-12-22,23-13-7-3-8-14-23)24-15-9-4-10-16-24/h2-16,19,25,31H,17-18,20H2,1H3,(H,29,32,33)
NCI pathway
Reactome pathway
n/an/a 3.60E+3n/an/an/an/an/an/a
Instituto de Qu£mica M£dica (CSIC)
Curated by ChEMBL
Assay Description
Inhibitory effect against phosphorylation of [methyl-3H]dThd by Thymidine Kinase 2 (TK-2)
J Med Chem 45: 4254-63 (2002)
BindingDB Entry DOI: 10.7270/Q2GQ6ZGB