BDBM50118502 5-Methyl-1-(2-trityloxymethyl-benzyl)-1H-pyrimidine-2,4-dione::CHEMBL132598
SMILES: Cc1cn(Cc2ccccc2COC(c2ccccc2)(c2ccccc2)c2ccccc2)c(=O)[nH]c1=O
InChI Key: InChIKey=MWBNZLRIOLFURT-UHFFFAOYSA-N
Data: 2 IC50
Activity Spreadsheet -- Enzyme Inhibition Constant Data from BindingDB
Found 2 hits for monomerid = 50118502
Trg + Lig
Ki
nM
ΔG°
kcal/mole
IC50
nM
Kd
nM
EC50/IC50
nM
koff
s-1
kon
M-1s-1
pHTemp
°C
Thymidine kinase, cytosolic
(Homo sapiens (Human))
BDBM50118502
(5-Methyl-1-(2-trityloxymethyl-benzyl)-1H-pyrimidin...)
Show SMILES Cc1cn(Cc2ccccc2COC(c2ccccc2)(c2ccccc2)c2ccccc2)c(=O)[nH]c1=O
Show InChI InChI=1S/C32H28N2O3/c1-24-21-34(31(36)33-30(24)35)22-25-13-11-12-14-26(25)23-37-32(27-15-5-2-6-16-27,28-17-7-3-8-18-28)29-19-9-4-10-20-29/h2-21H,22-23H2,1H3,(H,33,35,36)
NCI pathway
Reactome pathway
n/an/a 8n/an/an/an/an/an/a
Instituto de Qu£mica M£dica (CSIC)
Curated by ChEMBL
Assay Description
Inhibitory activity against HSV-1 Thymidine kinase in OST-TK-/HSV-1 TK+ cell line in combination with BVAraU
J Med Chem 45: 4254-63 (2002)
BindingDB Entry DOI: 10.7270/Q2GQ6ZGB
Thymidine kinase, cytosolic
(Homo sapiens (Human))
BDBM50118502
(5-Methyl-1-(2-trityloxymethyl-benzyl)-1H-pyrimidin...)
Show SMILES Cc1cn(Cc2ccccc2COC(c2ccccc2)(c2ccccc2)c2ccccc2)c(=O)[nH]c1=O
Show InChI InChI=1S/C32H28N2O3/c1-24-21-34(31(36)33-30(24)35)22-25-13-11-12-14-26(25)23-37-32(27-15-5-2-6-16-27,28-17-7-3-8-18-28)29-19-9-4-10-20-29/h2-21H,22-23H2,1H3,(H,33,35,36)
NCI pathway
Reactome pathway
n/an/a 2n/an/an/an/an/an/a
Instituto de Qu£mica M£dica (CSIC)
Curated by ChEMBL
Assay Description
Inhibitory activity against HSV-1 Thymidine kinase in OST-TK-/HSV-1 TK+ cell line in combination with gancicclovir
J Med Chem 45: 4254-63 (2002)
BindingDB Entry DOI: 10.7270/Q2GQ6ZGB