BDBM50118607 CHEMBL3617098
SMILES: CCCCc1cc(=O)n2nc(NCc3ccc(Cl)cc3)c(C#N)c2[nH]1
InChI Key: InChIKey=BRPLBEUKOQOJSJ-UHFFFAOYSA-N
Data: 2 IC50
Activity Spreadsheet -- Enzyme Inhibition Constant Data from BindingDB
Found 2 hits for monomerid = 50118607
Trg + Lig
Ki
nM
ΔG°
kcal/mole
IC50
nM
Kd
nM
EC50/IC50
nM
koff
s-1
kon
M-1s-1
pHTemp
°C
Branched-chain-amino-acid aminotransferase, mitochondrial
(Homo sapiens (Human))
BDBM50118607
(CHEMBL3617098)
Show SMILES CCCCc1cc(=O)n2nc(NCc3ccc(Cl)cc3)c(C#N)c2[nH]1
Show InChI InChI=1S/C18H18ClN5O/c1-2-3-4-14-9-16(25)24-18(22-14)15(10-20)17(23-24)21-11-12-5-7-13(19)8-6-12/h5-9,22H,2-4,11H2,1H3,(H,21,23)
n/an/a 40n/an/an/an/an/an/a
GlaxoSmithKline R&D
Curated by ChEMBL
Assay Description
Inhibition of human cloned BCATm expressed in Escherichia coli BL21 DE3 assessed as L-glutamate production from alpha-ketoglutarate after 10 mins by ...
J Med Chem 58: 7140-63 (2015)
BindingDB Entry DOI: 10.7270/Q2T43VWK
Branched-chain-amino-acid aminotransferase, mitochondrial
(Homo sapiens (Human))
BDBM50118607
(CHEMBL3617098)
Show SMILES CCCCc1cc(=O)n2nc(NCc3ccc(Cl)cc3)c(C#N)c2[nH]1
Show InChI InChI=1S/C18H18ClN5O/c1-2-3-4-14-9-16(25)24-18(22-14)15(10-20)17(23-24)21-11-12-5-7-13(19)8-6-12/h5-9,22H,2-4,11H2,1H3,(H,21,23)
n/an/a 200n/an/an/an/an/an/a
GlaxoSmithKline R&D
Curated by ChEMBL
Assay Description
Inhibition of BCATm in differentiated primary human adipocytes assessed as remaining leucine level by reversed phase HPLC analysis
J Med Chem 58: 7140-63 (2015)
BindingDB Entry DOI: 10.7270/Q2T43VWK