BDBM50118750 2-(Oxalyl-amino)-6-phenethyl-4,5,6,7-tetrahydro-thieno[2,3-c]pyridine-3-carboxylic acid::CHEMBL140120
SMILES: OC(=O)C(=O)Nc1sc2CN(CCc3ccccc3)CCc2c1C(O)=O
InChI Key: InChIKey=ZIMJSFGMHLCHIV-UHFFFAOYSA-N
Data: 8 KI
Activity Spreadsheet -- Enzyme Inhibition Constant Data from BindingDB
Found 8 hits for monomerid = 50118750
Trg + Lig
Ki
nM
ΔG°
kcal/mole
IC50
nM
Kd
nM
EC50/IC50
nM
koff
s-1
kon
M-1s-1
pHTemp
°C
Protein-tyrosine phosphatase 1B
(Homo sapiens (Human))
BDBM50118750
(2-(Oxalyl-amino)-6-phenethyl-4,5,6,7-tetrahydro-th...)
Show SMILES OC(=O)C(=O)Nc1sc2CN(CCc3ccccc3)CCc2c1C(O)=O
Show InChI InChI=1S/C18H18N2O5S/c21-15(18(24)25)19-16-14(17(22)23)12-7-9-20(10-13(12)26-16)8-6-11-4-2-1-3-5-11/h1-5H,6-10H2,(H,19,21)(H,22,23)(H,24,25)
NCI pathway
Reactome pathway
270n/an/an/an/an/an/a5.5n/a
Chinese Academy of Sciences
Curated by ChEMBL
Assay Description
Inhibition of human recombinant PTP1B (1 to 321 residues) catalytic domain expressed in Escherichia coli BL21 (DE3) cells using p-nitrophenyl phospha...
Bioorg Med Chem 24: 3343-52 (2016)
BindingDB Entry DOI: 10.7270/Q20Z756P
Protein-tyrosine phosphatase 1B
(Homo sapiens (Human))
BDBM50118750
(2-(Oxalyl-amino)-6-phenethyl-4,5,6,7-tetrahydro-th...)
Show SMILES OC(=O)C(=O)Nc1sc2CN(CCc3ccccc3)CCc2c1C(O)=O
Show InChI InChI=1S/C18H18N2O5S/c21-15(18(24)25)19-16-14(17(22)23)12-7-9-20(10-13(12)26-16)8-6-11-4-2-1-3-5-11/h1-5H,6-10H2,(H,19,21)(H,22,23)(H,24,25)
NCI pathway
Reactome pathway
270n/an/an/an/an/an/a5.5n/a
Novo Nordisk A/S
Curated by ChEMBL
Assay Description
Inhibitory effect against recombinant human protein-tyrosine phosphatase 1B (PTP1B), using p-nitrophenyl phosphate substrate at pH 5.5.
J Med Chem 45: 4443-59 (2002)
BindingDB Entry DOI: 10.7270/Q2QJ7GM5
Protein-tyrosine phosphatase 1B
(Homo sapiens (Human))
BDBM50118750
(2-(Oxalyl-amino)-6-phenethyl-4,5,6,7-tetrahydro-th...)
Show SMILES OC(=O)C(=O)Nc1sc2CN(CCc3ccccc3)CCc2c1C(O)=O
Show InChI InChI=1S/C18H18N2O5S/c21-15(18(24)25)19-16-14(17(22)23)12-7-9-20(10-13(12)26-16)8-6-11-4-2-1-3-5-11/h1-5H,6-10H2,(H,19,21)(H,22,23)(H,24,25)
NCI pathway
Reactome pathway
3.20E+3n/an/an/an/an/an/an/an/a
Novo Nordisk A/S
Curated by ChEMBL
Assay Description
Inhibition of human recombinant Protein-tyrosine phosphatase 1B.
J Med Chem 45: 4443-59 (2002)
BindingDB Entry DOI: 10.7270/Q2QJ7GM5
Protein-tyrosine phosphatase 1B
(Homo sapiens (Human))
BDBM50118750
(2-(Oxalyl-amino)-6-phenethyl-4,5,6,7-tetrahydro-th...)
Show SMILES OC(=O)C(=O)Nc1sc2CN(CCc3ccccc3)CCc2c1C(O)=O
Show InChI InChI=1S/C18H18N2O5S/c21-15(18(24)25)19-16-14(17(22)23)12-7-9-20(10-13(12)26-16)8-6-11-4-2-1-3-5-11/h1-5H,6-10H2,(H,19,21)(H,22,23)(H,24,25)
NCI pathway
Reactome pathway
7.20E+3n/an/an/an/an/an/an/an/a
Novo Nordisk A/S
Curated by ChEMBL
Assay Description
Inhibition of human recombinant Protein-tyrosine phosphatase 1B.
J Med Chem 45: 4443-59 (2002)
BindingDB Entry DOI: 10.7270/Q2QJ7GM5
Tyrosine-protein phosphatase non-receptor type 2
(Homo sapiens (Human))
BDBM50118750
(2-(Oxalyl-amino)-6-phenethyl-4,5,6,7-tetrahydro-th...)
Show SMILES OC(=O)C(=O)Nc1sc2CN(CCc3ccccc3)CCc2c1C(O)=O
Show InChI InChI=1S/C18H18N2O5S/c21-15(18(24)25)19-16-14(17(22)23)12-7-9-20(10-13(12)26-16)8-6-11-4-2-1-3-5-11/h1-5H,6-10H2,(H,19,21)(H,22,23)(H,24,25)
7.20E+3n/an/an/an/an/an/a7.0n/a
Chinese Academy of Sciences
Curated by ChEMBL
Assay Description
Inhibition of recombinant TCPTP (unknown origin) at pH 7
Bioorg Med Chem 24: 3343-52 (2016)
BindingDB Entry DOI: 10.7270/Q20Z756P
Leukocyte common antigen
(Homo sapiens (Human))
BDBM50118750
(2-(Oxalyl-amino)-6-phenethyl-4,5,6,7-tetrahydro-th...)
Show SMILES OC(=O)C(=O)Nc1sc2CN(CCc3ccccc3)CCc2c1C(O)=O
Show InChI InChI=1S/C18H18N2O5S/c21-15(18(24)25)19-16-14(17(22)23)12-7-9-20(10-13(12)26-16)8-6-11-4-2-1-3-5-11/h1-5H,6-10H2,(H,19,21)(H,22,23)(H,24,25)
Reactome pathway
1.40E+6n/an/an/an/an/an/a7.0n/a
Novo Nordisk A/S
Curated by ChEMBL
Assay Description
Inhibitory effect against human CD45 tyrosine phosphatase using p-nitrophenyl phosphate substrate at a pH 7.0
J Med Chem 45: 4443-59 (2002)
BindingDB Entry DOI: 10.7270/Q2QJ7GM5
Protein-tyrosine phosphatase alpha
(Homo sapiens (Human))
BDBM50118750
(2-(Oxalyl-amino)-6-phenethyl-4,5,6,7-tetrahydro-th...)
Show SMILES OC(=O)C(=O)Nc1sc2CN(CCc3ccccc3)CCc2c1C(O)=O
Show InChI InChI=1S/C18H18N2O5S/c21-15(18(24)25)19-16-14(17(22)23)12-7-9-20(10-13(12)26-16)8-6-11-4-2-1-3-5-11/h1-5H,6-10H2,(H,19,21)(H,22,23)(H,24,25)
2.10E+6n/an/an/an/an/an/a7.0n/a
Novo Nordisk A/S
Curated by ChEMBL
Assay Description
Inhibitory effect against human Protein-tyrosine phosphatase alpha (PTPalpha) using p-nitrophenyl phosphate substrate at a pH 7.0
J Med Chem 45: 4443-59 (2002)
BindingDB Entry DOI: 10.7270/Q2QJ7GM5
Receptor-type tyrosine-protein phosphatase F (LAR)
(Homo sapiens (Human))
BDBM50118750
(2-(Oxalyl-amino)-6-phenethyl-4,5,6,7-tetrahydro-th...)
Show SMILES OC(=O)C(=O)Nc1sc2CN(CCc3ccccc3)CCc2c1C(O)=O
Show InChI InChI=1S/C18H18N2O5S/c21-15(18(24)25)19-16-14(17(22)23)12-7-9-20(10-13(12)26-16)8-6-11-4-2-1-3-5-11/h1-5H,6-10H2,(H,19,21)(H,22,23)(H,24,25)
2.10E+6n/an/an/an/an/an/a7.0n/a
Novo Nordisk A/S
Curated by ChEMBL
Assay Description
Inhibitory effect against human Protein-tyrosine phosphatase Lar using p-nitrophenyl phosphate substrate at a pH 7.0
J Med Chem 45: 4443-59 (2002)
BindingDB Entry DOI: 10.7270/Q2QJ7GM5