BDBM50118848 4-(6,7-Dimethoxy-quinazolin-4-yl)-piperazine-1-carboxylic acid [2-(4-bromo-phenyl)-2-oxo-ethyl]-amide::CHEMBL343164
SMILES: COc1cc2ncnc(N3CCN(CC3)C(=O)NCC(=O)c3ccc(Br)cc3)c2cc1OC
InChI Key: InChIKey=AYUPLIXTYYFUFT-UHFFFAOYSA-N
Data: 1 IC50
Activity Spreadsheet -- Enzyme Inhibition Constant Data from BindingDB
Found 1 hit for monomerid = 50118848
Trg + Lig
Ki
nM
ΔG°
kcal/mole
IC50
nM
Kd
nM
EC50/IC50
nM
koff
s-1
kon
M-1s-1
pHTemp
°C
PDGFR-beta/Platelet-derived growth factor receptor alpha
(Homo sapiens (Human))
BDBM50118848
(4-(6,7-Dimethoxy-quinazolin-4-yl)-piperazine-1-car...)
Show SMILES COc1cc2ncnc(N3CCN(CC3)C(=O)NCC(=O)c3ccc(Br)cc3)c2cc1OC
Show InChI InChI=1S/C23H24BrN5O4/c1-32-20-11-17-18(12-21(20)33-2)26-14-27-22(17)28-7-9-29(10-8-28)23(31)25-13-19(30)15-3-5-16(24)6-4-15/h3-6,11-12,14H,7-10,13H2,1-2H3,(H,25,31)
Reactome pathway
n/an/a 140n/an/an/an/an/an/a
Kyowa Hakko Kogyo Co., Ltd.
Curated by ChEMBL
Assay Description
Concentration required for 50% inhibition against autophosphorylation of Platelet-derived growth factor receptor beta in intact cells using a two sit...
J Med Chem 45: 4513-23 (2002)
BindingDB Entry DOI: 10.7270/Q2JH3MXF