BDBM50119525 CHEMBL3613882
SMILES: CCC(=O)N(C1CCN(Cc2ccc3[C@@H](O)CCCc3c2)CC1)c1ccccc1
InChI Key: InChIKey=FDNVARBCVAIKSE-DEOSSOPVSA-N
Data: 2 KI  2 IC50
Activity Spreadsheet -- Enzyme Inhibition Constant Data from BindingDB
Found 4 hits for monomerid = 50119525
Trg + Lig
Ki
nM
ΔG°
kcal/mole
IC50
nM
Kd
nM
EC50/IC50
nM
koff
s-1
kon
M-1s-1
pHTemp
°C
Mu-type opioid receptor
(Rattus norvegicus (rat))
BDBM50119525
(CHEMBL3613882)
Show SMILES CCC(=O)N(C1CCN(Cc2ccc3[C@@H](O)CCCc3c2)CC1)c1ccccc1 |r|
Show InChI InChI=1S/C25H32N2O2/c1-2-25(29)27(21-8-4-3-5-9-21)22-13-15-26(16-14-22)18-19-11-12-23-20(17-19)7-6-10-24(23)28/h3-5,8-9,11-12,17,22,24,28H,2,6-7,10,13-16,18H2,1H3/t24-/m0/s1
Reactome pathway
2n/an/an/an/an/an/an/an/a
University of Arizona
Curated by ChEMBL
Assay Description
Displacement of [3H]-DAMGO from rat mu opioid receptor transfected in HN9.10 cell membranes by scintillation counting analysis
Bioorg Med Chem 23: 6185-94 (2015)
BindingDB Entry DOI: 10.7270/Q2S46TSN
Delta-type opioid receptor
(Homo sapiens (Human))
BDBM50119525
(CHEMBL3613882)
Show SMILES CCC(=O)N(C1CCN(Cc2ccc3[C@@H](O)CCCc3c2)CC1)c1ccccc1 |r|
Show InChI InChI=1S/C25H32N2O2/c1-2-25(29)27(21-8-4-3-5-9-21)22-13-15-26(16-14-22)18-19-11-12-23-20(17-19)7-6-10-24(23)28/h3-5,8-9,11-12,17,22,24,28H,2,6-7,10,13-16,18H2,1H3/t24-/m0/s1
Reactome pathway
>1.00E+4n/an/an/an/an/an/an/an/a
University of Arizona
Curated by ChEMBL
Assay Description
Displacement of [3H]-DPDPE from human delta opioid receptor transfected in HN9.10 cell membranes by scintillation counting analysis
Bioorg Med Chem 23: 6185-94 (2015)
BindingDB Entry DOI: 10.7270/Q2S46TSN
Mu-type opioid receptor
(GUINEA PIG)
BDBM50119525
(CHEMBL3613882)
Show SMILES CCC(=O)N(C1CCN(Cc2ccc3[C@@H](O)CCCc3c2)CC1)c1ccccc1 |r|
Show InChI InChI=1S/C25H32N2O2/c1-2-25(29)27(21-8-4-3-5-9-21)22-13-15-26(16-14-22)18-19-11-12-23-20(17-19)7-6-10-24(23)28/h3-5,8-9,11-12,17,22,24,28H,2,6-7,10,13-16,18H2,1H3/t24-/m0/s1
n/an/a 55n/an/an/an/an/an/a
University of Arizona
Curated by ChEMBL
Assay Description
Agonist activity at mu opioid receptor in electrically-stimulated guinea pig isolated ileum assessed as inhibition of muscle contraction
Bioorg Med Chem 23: 6185-94 (2015)
BindingDB Entry DOI: 10.7270/Q2S46TSN
Mu-type opioid receptor
(Rattus norvegicus (rat))
BDBM50119525
(CHEMBL3613882)
Show SMILES CCC(=O)N(C1CCN(Cc2ccc3[C@@H](O)CCCc3c2)CC1)c1ccccc1 |r|
Show InChI InChI=1S/C25H32N2O2/c1-2-25(29)27(21-8-4-3-5-9-21)22-13-15-26(16-14-22)18-19-11-12-23-20(17-19)7-6-10-24(23)28/h3-5,8-9,11-12,17,22,24,28H,2,6-7,10,13-16,18H2,1H3/t24-/m0/s1
Reactome pathway
n/an/a 2.60n/an/an/an/an/an/a
University of Arizona
Curated by ChEMBL
Assay Description
Displacement of [3H]-DAMGO from rat mu opioid receptor transfected in HN9.10 cell membranes by scintillation counting analysis
Bioorg Med Chem 23: 6185-94 (2015)
BindingDB Entry DOI: 10.7270/Q2S46TSN