BDBM50119665 5-Benzo[1,3]dioxol-5-yl-2-but-3-enyl-7-(4-methoxy-phenyl)-6,7-dihydro-5H-[1]pyrindine-6-carboxylic acid::CHEMBL101424
SMILES: COc1ccc(cc1)[C@H]1[C@@H]([C@H](c2ccc(CCC=C)nc12)c1ccc2OCOc2c1)C(O)=O
InChI Key: InChIKey=XBXKAPLYGJALOL-CCDWMCETSA-N
Data: 2 IC50
Activity Spreadsheet -- Enzyme Inhibition Constant Data from BindingDB
Found 2 hits for monomerid = 50119665
Trg + Lig
Ki
nM
ΔG°
kcal/mole
IC50
nM
Kd
nM
EC50/IC50
nM
koff
s-1
kon
M-1s-1
pHTemp
°C
EDNRB
(Homo sapiens (Human))
BDBM50119665
(5-Benzo[1,3]dioxol-5-yl-2-but-3-enyl-7-(4-methoxy-...)
Show SMILES COc1ccc(cc1)[C@H]1[C@@H]([C@H](c2ccc(CCC=C)nc12)c1ccc2OCOc2c1)C(O)=O
Show InChI InChI=1S/C27H25NO5/c1-3-4-5-18-9-12-20-23(17-8-13-21-22(14-17)33-15-32-21)25(27(29)30)24(26(20)28-18)16-6-10-19(31-2)11-7-16/h3,6-14,23-25H,1,4-5,15H2,2H3,(H,29,30)/t23-,24-,25+/m0/s1
n/an/a 14n/an/an/an/an/an/a
Tsukuba Research Institute
Curated by ChEMBL
Assay Description
Inhibitory activity of the compound against I-labeled ET-1 binding to Endothelin B receptor
Bioorg Med Chem Lett 12: 3041-5 (2002)
BindingDB Entry DOI: 10.7270/Q2KK9B3N
Endothelin-1 receptor
(Homo sapiens (Human))
BDBM50119665
(5-Benzo[1,3]dioxol-5-yl-2-but-3-enyl-7-(4-methoxy-...)
Show SMILES COc1ccc(cc1)[C@H]1[C@@H]([C@H](c2ccc(CCC=C)nc12)c1ccc2OCOc2c1)C(O)=O
Show InChI InChI=1S/C27H25NO5/c1-3-4-5-18-9-12-20-23(17-8-13-21-22(14-17)33-15-32-21)25(27(29)30)24(26(20)28-18)16-6-10-19(31-2)11-7-16/h3,6-14,23-25H,1,4-5,15H2,2H3,(H,29,30)/t23-,24-,25+/m0/s1
n/an/a 0.200n/an/an/an/an/an/a
Tsukuba Research Institute
Curated by ChEMBL
Assay Description
Inhibitory activity of the compound against I-labeled ET-1 binding to Endothelin A receptor
Bioorg Med Chem Lett 12: 3041-5 (2002)
BindingDB Entry DOI: 10.7270/Q2KK9B3N